program: Gaussian 09
title: 000228432
version: EM64L-G09RevD.01
frameworkgroup: C1[X(C6H7BrO3)]
method: RPBEPBE
basis: SDD
operation: Freq
keyword: #p
keyword: freq=noraman
keyword: PBEPBE/SDD
title: #p freq=noraman PBEPBE/SDD
converged: NO YES NO NO
title: Mulliken charges:
elementType: Br O O O C C C C C C H H H H H H H
charge: 0.040145 -0.162885 -0.128010 -0.156850 0.036860 0.193909 0.210965 -0.684201 -0.674542 -0.473774 0.247760 0.244673 0.230445 0.243548 0.246372 0.246019 0.339566
chargesum: 0.00000
title: Mulliken charges with hydrogens summed into heavy atoms:
elementType: Br O O O C C C C C C
charge: 0.040145 -0.162885 -0.128010 -0.156850 0.036860 0.193909 0.210965 0.038677 0.061397 -0.134208
polarizability: 1.11531820e+02 -3.91147274e+00 7.80782890e+01 -4.40715292e+00 -2.10490386e+00 6.91734910e+01
1716.lowfreq: -12.1517 -0.0006 -0.0004 -0.0001 7.6607 9.6758 48.2206 73.9275 136.2029
frequency: 48.1695 73.8889 136.1981 180.7791 193.2286 222.9428 225.0278 262.1131 279.4312 292.2046 380.3652 490.7192 541.5796 593.5406 631.3140 678.2382 690.0805 737.1091 802.2696 885.3314 946.7404 962.8893 1003.9210 1015.3916 1082.3722 1113.5524 1162.6083 1201.8561 1235.3315 1252.3673 1377.1073 1397.5484 1458.1605 1466.8749 1475.2767 1487.5204 1677.8100 1751.5482 2997.7554 3000.6251 3102.1924 3106.2060 3108.0316 3115.0858 3135.0937
redmass: 4.7941 12.8292 10.4471 3.0346 1.0381 2.9636 1.6503 12.9635 1.8917 3.5498 4.9420 6.9915 6.7365 6.3859 7.9158 7.3739 7.6213 5.8132 2.5904 4.2145 3.3889 1.5252 3.0194 1.3841 3.3192 2.9450 1.3659 2.6140 2.8694 1.4317 1.1560 1.1886 1.0493 1.0453 1.0554 1.0550 11.9261 12.3075 1.0337 1.0343 1.1010 1.1014 1.1019 1.1016 1.0899
irintensity: 3.7150 0.3025 1.9611 0.0732 0.0461 6.6776 2.4727 11.5125 1.1093 6.9465 6.9452 27.7811 39.4734 22.2899 7.4380 6.4779 5.6296 29.8311 48.1403 119.9574 160.4964 22.5851 72.9964 7.1789 112.8694 1.3709 7.6608 9.2466 38.7319 18.4350 9.7999 22.5943 14.5070 0.2288 15.7715 16.9368 222.3071 197.7056 11.4839 14.2255 14.1826 12.7428 6.4190 9.1006 0.7597
temp: 298.150 k
press: 1.00000 atm
elementType: 35 8 8 8 6 6 6 6 6 6 1 1 1 1 1 1 1
symmnumber: 1
zpe: 316881.2 jmol-1
zpe.correction: 0.120694 hartree
zpe.thermalcorrener: 0.131225 hartree
zpe.thermalcorrenthalpy: 0.132169 hartree
zpe.thermalcorrgfe: 0.083418 hartree
zpe.sumelectzpe: -471.199753 hartree
zpe.sumelectthermal: -471.189221 hartree
zpe.sumelectthermalent: -471.188277 hartree
zpe.sumelectthermalfe: -471.237029 hartree
dipole: 1.5157 1.7116 0.3355
dipole: 2.3107
quadrupole: -65.8485 -83.0298 -62.1938
quadrupole: 6.2476 0.9089 0.9757
quadrupole: 4.5089 -12.6724 8.1635 6.2476 0.9089 0.9757
hfenergy: -471.3204462 hartree
pointgroup: C01 [X(C6H7Br1O3)]
dipole: -0.4006137 -0.8132037 -0.0685278 debye
dipolederiv: -0.4901164 -0.0759564 -0.199695 -0.0840914 -0.1598208 -0.0525683 -0.4380009 -0.0229468 -0.3544009 -1.6647249 0.0661371 -0.1372072 0.0899634 -0.4719909 0.1709858 0.3442057 0.0344529 -0.2634562 -0.4966991 0.1408894 0.1032696 0.0920225 -0.7547482 -0.2257945 0.0987993 -0.1080952 -0.2997407 -1.0104388 0.2336351 0.0054873 0.3830363 -0.6641524 0.0082342 0.1179701 0.0057316 -0.2752883 -0.3937547 0.0029835 0.1263873 -0.0762263 -0.3011358 0.047071 0.2243576 0.0490905 -0.0480301 0.9277785 -0.0155477 -0.2095758 0.0890699 0.8978194 0.3208485 -0.3417301 0.1439787 0.0753769 1.9388654 -0.222303 -0.1001139 0.050894 1.0810151 -0.0788164 -0.5382761 -0.0689928 0.1696377 0.080996 0.0664177 -0.0050655 0.0604954 0.0329549 -0.0113968 0.0712148 0.0317953 0.0725354 -0.0049098 0.0168336 -0.0002709 0.0403092 0.0327846 -0.030001 -0.1109019 -0.0645531 0.0968529 0.9895076 -0.2203135 0.4368956 -0.6330663 0.0996241 -0.1314743 0.5624807 -0.0105874 0.6910979 0.08574 0.0309194 -0.0220603 -0.0134997 -0.0841657 0.0072255 -0.0279116 0.0269627 0.090793 -0.0790927 0.009119 0.0294673 0.0396238 0.0899416 -0.0328181 0.0588822 -0.0286614 0.069879 0.0820327 -0.0268351 0.038183 -0.0168355 0.0774577 0.0657829 -0.008285 0.0295789 -0.1115866 0.1065633 0.0236179 0.0136086 0.00176 -0.0911477 0.0392737 0.0183663 0.0051004 0.0636068 0.0250623 -0.0619003 -0.0936871 -0.0598431 0.0553366 -0.0604311 -0.0618566 -0.0365234 0.0083621 -0.0758798 0.0295315 0.0673939 0.0423618 0.0941144 0.0092064 0.0469468 0.0116534 0.0565828 -0.0209297 0.0027716 -0.0530167 -0.0059742 0.0661131 -0.0453273 -0.0162612 0.0020156 -0.0422219 unknown
polarizability: 107.2285916|3.1973696|77.3283946|13.0188884|5.1075204|74.2266142 unknown
InChI: InChI=1S/C6H7BrO3/c1-6(2)3(8)4(7)10-5(6)9/h4H,1-2H3
charge 0 multiplicity 1
17 atoms
Br 2.605784 0.777086 1.070227
O  0.359639 1.528526 -0.598284
O  1.158979 -1.95085 -0.608461
O  -1.890653 1.715633 -0.013585
C  -0.783662 -0.534148 0.053696
C  0.656943 -0.833065 -0.385412
C  -0.913317 0.980834 -0.142544
C  -1.811874 -1.285923 -0.833282
C  -0.980436 -0.904248 1.555918
C  1.380568 0.516475 -0.554816
H  -1.650369 -2.372186 -0.730804
H  -2.835132 -1.035431 -0.507303
H  -1.711078 -1.018907 -1.899509
H  -0.8390 -1.991302 1.679953
H  -0.263174 -0.379248 2.209225
H  -2.004265 -0.633686 1.865871
H  2.052448 0.598643 -1.418986
