program: Gaussian 09
title: 000228413
version: EM64L-G09RevD.01
frameworkgroup: C1[X(C15H20O3)]
method: RPBEPBE
basis: SDD
operation: Freq
keyword: #pfreq=noraman
keyword: PBEPBE/SDD
title: #p freq=noraman PBEPBE/SDD
converged: NO YES NO NO
title: Mulliken charges:
elementType: O O O C C C C C C C C C C C C C C C H H H H H H H H H H H H H H H H H H H H
charge: -0.464363 -0.273534 -0.242746 0.364840 -0.492654 -0.498253 -0.446043 -0.406977 -0.388536 -0.394119 0.437161 0.233335 -0.431528 -0.363548 -0.237268 -0.252362 -0.241863 -0.508628 0.252815 0.221306 0.234407 0.188739 0.246782 0.224396 0.193581 0.191561 0.210962 0.188522 0.203552 0.335291 0.230097 0.282089 0.225618 0.226784 0.229059 0.244294 0.247033 0.230201
chargesum: 0.00000
title: Mulliken charges with hydrogens summed into heavy atoms:
elementType: O O O C C C C C C C C C C C C C C C
charge: -0.129072 -0.273534 -0.242746 0.364840 -0.018533 -0.075107 -0.199261 0.011000 0.013987 -0.002045 0.437161 0.233335 -0.201431 -0.081459 -0.011650 -0.025578 -0.012805 0.212900
polarizability: 1.76102014e+02 -2.14183925e+01 1.64016394e+02 5.09531087e+00 1.67268860e+00 1.54161862e+02
1716.lowfreq: -20.4179 -9.2097 -4.0963 0.0002 0.0006 0.0007 38.2907 48.1127 59.8082
frequency: 38.2421 48.1020 59.6479 68.0141 94.7558 109.3065 119.0382 134.5986 192.9889 202.5774 227.5193 242.6727 255.1815 280.3326 286.6945 310.3619 327.0792 340.6554 399.3844 406.6538 409.1836 464.0062 481.6916 500.7215 558.6004 615.3889 639.8759 681.9804 700.2461 709.8330 731.3620 777.2730 786.7281 825.1645 837.9745 851.5372 858.8552 860.9871 918.6341 919.8024 927.5803 930.6500 945.4553 981.1613 984.1074 991.8521 999.5313 1030.8866 1039.2524 1052.8279 1064.6989 1085.7090 1095.2366 1100.6490 1112.8373 1131.8083 1148.3997 1151.2585 1172.1198 1173.2039 1194.6344 1201.9741 1224.3732 1253.6561 1260.1945 1282.0010 1304.1218 1321.6058 1334.4509 1337.7212 1345.4586 1348.5416 1352.3384 1379.9969 1388.9578 1418.9939 1442.5414 1451.2191 1456.7831 1458.5688 1462.5283 1464.0224 1467.6514 1476.2664 1482.6901 1589.6066 1611.4741 1646.8830 2958.5377 2962.3181 2985.9798 2990.0083 2999.9303 3001.7854 3006.0729 3024.2745 3029.0615 3045.8215 3053.2354 3070.4340 3109.7519 3115.2241 3126.9298 3140.4685 3148.7794 3156.8026 3168.1812 3540.1431
redmass: 3.9774 3.6073 4.1145 3.9169 1.3236 2.9528 3.3541 3.4251 3.7926 2.5277 3.9016 3.6388 4.7174 2.2150 4.3452 1.8964 1.9383 4.5935 2.5488 2.3586 2.7018 2.6121 3.2205 2.6028 4.0514 6.3886 4.6613 4.0073 5.0037 1.9690 2.6975 1.6134 2.1975 2.5038 3.9996 2.6670 1.3217 2.8554 2.0350 1.7100 2.4461 1.5707 2.6193 1.6285 2.6851 5.9345 1.3485 2.1860 3.0657 1.8448 1.5559 1.6016 1.5943 2.5056 1.2829 1.7942 1.4446 2.2707 1.1734 1.2384 1.1168 2.5217 1.2782 1.3190 1.2818 1.3046 1.7129 1.3209 1.4124 1.3759 1.4648 1.4356 1.4886 2.7424 2.4236 1.1918 2.0879 1.0501 1.0951 1.0877 1.0944 1.0507 1.0813 1.0949 2.2381 5.9524 5.9787 8.8441 1.0619 1.0632 1.0621 1.0611 1.0639 1.0808 1.0302 1.0978 1.0957 1.1022 1.1012 1.1018 1.1046 1.0869 1.0871 1.0930 1.1051 1.0967 1.0987 1.0655
irintensity: 1.3564 0.3313 0.1307 0.1263 0.6713 0.5912 0.9372 2.0676 14.4816 3.5341 5.7375 3.7434 7.8638 22.5611 3.5637 18.3226 95.8151 29.7873 1.7197 1.8265 0.3558 2.9734 7.1301 12.6934 9.1888 0.2289 12.5748 1.3533 6.7365 50.4375 29.3571 8.9159 9.1524 11.2124 7.6992 7.8075 0.4452 4.0553 22.7294 4.0571 21.7696 3.3001 11.6199 5.9424 12.0871 5.7856 0.5088 7.5306 33.4521 12.3011 4.7574 16.5056 42.7588 186.4234 4.4566 84.5367 11.1966 25.5169 3.8348 15.0483 0.6757 7.5983 28.6928 8.9001 10.2799 1.1911 45.4147 6.5166 10.1934 10.2527 5.4965 27.4798 6.2913 14.1927 9.2695 22.0224 10.7549 14.9443 0.1486 10.7527 5.1926 12.3887 18.6563 5.1112 24.3179 2.2226 7.1277 118.6142 33.0649 37.0269 44.2292 44.8004 14.3843 10.0106 33.1938 27.4850 68.4952 21.4451 53.8449 33.6589 22.6616 8.2439 1.9787 30.3771 16.6098 22.6807 13.3154 6.1212
temp: 298.150 k
press: 1.00000 atm
elementType: 8 8 8 6 6 6 6 6 6 6 6 6 6 6 6 6 6 6 1 1 1 1 1 1 1 1 1 1 1 1 1 1 1 1 1 1 1 1
symmnumber: 1
zpe: 837301.5 jmol-1
zpe.correction: 0.318911 hartree
zpe.thermalcorrener: 0.336559 hartree
zpe.thermalcorrenthalpy: 0.337504 hartree
zpe.thermalcorrgfe: 0.273255 hartree
zpe.sumelectzpe: -807.903256 hartree
zpe.sumelectthermal: -807.885608 hartree
zpe.sumelectthermalent: -807.884663 hartree
zpe.sumelectthermalfe: -807.948912 hartree
dipole: 0.4212 -0.0797 -2.2189
dipole: 2.2599
quadrupole: -107.9274 -97.3686 -104.3244
quadrupole: -4.2674 2.3266 -3.3865
quadrupole: -4.7205 5.8382 -1.1176 -4.2674 2.3266 -3.3865
hfenergy: -808.2221671 hartree
pointgroup: C01 [X(C15H20O3)]
dipole: 0.1378424 -0.1816924 -0.8593617 debye
polarizability: 156.3197759|-16.9870567|183.3421087|6.884295|-3.5523437|154.6183861 unknown
InChI: InChI=1S/C15H20O3/c1-18-14(16)13(12-8-4-2-5-9-12)15(17)10-6-3-7-11-15/h2,4-5,8-9,13,17H,3,6-7,10-11H2,1H3
charge 0 multiplicity 1
38 atoms
O  -1.608697 1.746001 -0.567846
O  1.296144 2.613173 -0.9627
O  1.301276 1.935496 1.261309
C  -1.093402 0.38922 -0.236714
C  -1.449459 0.178145 1.247763
C  -1.788348 -0.66784 -1.132778
C  0.47068 0.406174 -0.530768
C  -2.9804 0.144889 1.470734
C  -3.318168 -0.699987 -0.903958
C  -3.655117 -0.930295 0.587437
C  1.224922 -0.857616 -0.114378
C  1.059921 1.685542 0.059548
C  1.498966 -1.84608 -1.095613
C  1.659029 -1.084935 1.21859
C  2.175531 -3.039081 -0.757343
C  2.338451 -2.276202 1.556325
C  2.596645 -3.259908 0.573896
C  1.796276 3.937385 -0.516278
H  -0.986674 0.979953 1.84967
H  -1.009643 -0.782254 1.576389
H  -1.359079 -1.663293 -0.907064
H  -1.563366 -0.45299 -2.198946
H  0.56025 0.510009 -1.62989
H  -3.40059 1.138354 1.225522
H  -3.189275 -0.047727 2.540738
H  -3.768345 -1.493076 -1.532111
H  -3.753585 0.26535 -1.227409
H  -3.302046 -1.937313 0.894934
H  -4.752214 -0.915342 0.735437
H  -1.33043 1.9764 -1.492281
H  1.185366 -1.677626 -2.133576
H  1.483732 -0.317079 1.978239
H  2.378905 -3.788603 -1.530542
H  2.670685 -2.433856 2.588724
H  3.125146 -4.182232 0.839999
H  2.739194 3.819132 0.04281
H  1.047449 4.422504 0.131942
H  1.95097 4.507608 -1.442911
