program: Gaussian 09
title: 000228427
version: EM64L-G09RevD.01
frameworkgroup: C1[X(C20H22N4O2S)]
method: RPBEPBE
basis: SDD
operation: Freq
keyword: #p
keyword: freq=noraman
keyword: PBEPBE/SDD
title: #p freq=noraman PBEPBE/SDD
converged: NO YES NO NO
title: Mulliken charges:
elementType: S O O N N N N C C C C C C C C C C C C C C C C C C C C H H H H H H H H H H H H H H H H H H H H H H
charge: 0.150403 -0.230788 -0.290394 -0.402673 -0.367190 0.033014 0.038395 -0.669118 -0.634661 -0.477037 -0.506673 0.241238 0.328078 0.445956 0.435941 -0.392357 -0.365006 -0.388156 -0.379847 -0.378424 -0.330794 -0.251558 -0.224642 -0.219937 -0.209966 -0.242735 -0.240044 0.293645 0.257903 0.268913 0.266527 0.235133 0.239776 0.217789 0.249968 0.367382 0.288275 0.226896 0.200115 0.232519 0.222964 0.284135 0.274130 0.228663 0.230667 0.227528 0.254252 0.228565 0.233227
chargesum: 0.00000
title: Mulliken charges with hydrogens summed into heavy atoms:
elementType: S O O N N N N C C C C C C C C C C C C C C C C C C C C
charge: 0.150403 -0.230788 -0.290394 -0.035291 -0.078915 0.033014 0.038395 -0.117570 -0.099221 -0.002128 -0.038916 0.241238 0.328078 0.445956 0.435941 -0.165461 -0.164891 -0.155637 -0.156883 -0.094288 -0.056663 -0.022895 0.006025 0.007592 0.044286 -0.014170 -0.006817
polarizability: 4.63109649e+02 -6.13311686e+00 2.61032478e+02 1.31501368e+01 1.01312482e+01 1.87870800e+02
1716.lowfreq: -10.5616 -3.3795 -2.4987 -0.0016 -0.0016 -0.0014 8.2937 20.0169 24.5681
frequency: 4.4932 19.8323 24.5657 34.0736 42.3718 54.8212 62.6445 68.1062 69.6306 73.7978 102.6934 136.9236 142.7727 153.2080 156.4433 196.5097 214.0122 227.3906 238.5676 245.5606 252.3619 259.3842 277.6811 307.2942 317.2457 352.5072 372.3732 403.3925 405.8724 411.7913 420.6530 468.2835 478.4112 511.5209 517.6598 564.0795 577.4846 607.9898 614.2030 614.7632 629.9781 637.1162 638.2194 645.8547 666.7453 691.9681 696.9538 701.2904 770.1821 774.0940 799.2411 832.3705 835.9121 853.9404 861.4590 873.2596 883.8769 921.3391 922.6637 923.8303 946.8427 956.9049 957.8280 967.1922 981.5160 983.5906 985.4729 987.2644 989.3875 1005.5476 1007.7070 1011.6452 1022.2103 1023.1540 1025.8087 1068.7606 1076.1583 1088.3449 1097.7838 1135.4065 1141.8333 1170.7975 1174.8351 1176.9030 1183.5498 1184.7506 1191.4387 1221.9560 1229.0950 1246.1755 1251.3808 1279.6000 1290.7142 1316.0967 1317.5100 1344.7846 1348.3649 1353.2487 1356.1214 1387.9639 1392.1354 1433.4791 1435.3921 1435.9709 1438.1662 1445.3078 1451.6267 1481.6477 1482.1362 1517.7034 1544.0464 1566.0172 1568.5996 1592.0192 1594.9048 1611.3735 1611.9624 1624.3088 1644.1008 2954.7318 2981.8497 2984.3299 2995.6064 3025.7355 3032.6241 3042.6087 3049.9049 3100.8251 3109.8058 3113.0309 3116.4105 3127.1495 3134.9257 3139.9967 3150.2319 3155.6961 3164.1260 3167.5402 3181.6797 3237.1476 3380.8062
redmass: 6.4703 5.9914 4.4697 4.2702 6.9755 5.4405 4.7380 5.9470 5.4866 6.0457 7.3707 5.1715 8.6436 5.9221 5.0906 4.3014 4.5059 2.8751 2.7828 2.8999 3.6488 5.6574 2.9907 4.4019 4.4854 3.4072 3.0953 2.8269 2.8746 5.4461 5.5152 4.8878 4.8176 3.0340 3.1476 4.2816 4.0894 4.9773 6.4102 6.3369 5.5094 4.1872 2.0118 2.4991 2.6904 3.1675 1.7516 1.8188 1.6686 1.7297 1.4969 3.8592 2.6146 1.2551 1.2496 2.4343 2.5101 1.7246 1.4884 1.4985 2.6577 1.5927 1.6054 2.6532 2.3955 1.3828 1.5895 4.3775 4.7135 1.3362 4.3151 1.3731 2.1969 2.2174 3.2563 2.5900 1.9416 1.6913 2.6504 1.2391 1.3718 1.0592 1.0645 1.3907 1.1183 1.1162 1.3159 1.9093 1.7621 1.9045 1.9288 1.2107 1.2364 1.5002 1.5095 1.4195 1.5184 1.6133 1.5906 5.3807 6.3373 1.0907 1.8918 1.2252 2.2946 1.1092 1.0926 2.2446 2.3257 1.9118 2.1467 3.6493 5.5930 4.8817 5.4584 5.8480 6.0020 6.3090 5.0987 1.0865 1.0594 1.0614 1.0877 1.0599 1.0673 1.0913 1.0981 1.1061 1.1067 1.0870 1.0879 1.0870 1.0880 1.0924 1.0928 1.0963 1.0981 1.0996 1.0960 1.0814 1.0757
irintensity: 1.6110 0.8510 0.3753 0.2898 2.8553 0.6858 0.7100 1.7467 10.1135 1.1078 3.2179 1.5213 10.7287 0.5612 9.8859 0.8951 0.7228 11.3593 20.0993 26.6555 2.1875 1.6751 0.0792 9.8604 9.8414 15.1988 0.6757 0.2009 0.0436 2.5166 1.1195 3.5551 3.1622 6.2143 8.7978 10.8148 5.4858 3.3185 0.1769 0.1009 3.5871 14.3351 46.0146 28.2159 5.7585 4.7602 51.1200 42.3013 91.5756 30.5618 102.1230 10.6189 30.0003 0.1825 0.4248 9.6401 23.3411 16.2354 5.4404 0.5618 15.7494 49.6838 33.6635 10.9073 16.4552 0.8735 0.6848 2.7496 0.5201 1.7847 38.4710 2.6580 23.8736 4.3303 12.8964 19.2427 18.0736 4.6551 7.7745 82.7027 113.2156 0.0544 0.7844 27.2934 0.3645 1.7496 89.4529 52.9586 66.9623 72.5810 161.4412 14.8183 10.5090 3.4133 13.1544 16.0086 14.5399 50.9186 13.9174 0.2912 7.3087 11.9239 18.7768 22.2288 16.4229 29.9994 49.1842 29.2645 17.7557 158.9853 226.3534 47.8524 35.9099 11.2346 27.9801 0.1710 7.0217 350.7473 186.4609 58.1751 23.6870 13.0687 31.8491 41.0162 25.8519 28.4751 18.2953 6.6855 11.5554 8.5714 8.0701 0.5197 5.0741 30.3803 15.6509 22.5025 30.2778 20.1228 4.1396 247.5122 15.2131
temp: 298.150 k
press: 1.00000 atm
elementType: 16 8 8 7 7 7 7 6 6 6 6 6 6 6 6 6 6 6 6 6 6 6 6 6 6 6 6 1 1 1 1 1 1 1 1 1 1 1 1 1 1 1 1 1 1 1 1 1 1
symmnumber: 1
zpe: 1012441.3 jmol-1
zpe.correction: 0.385619 hartree
zpe.thermalcorrener: 0.411571 hartree
zpe.thermalcorrenthalpy: 0.412515 hartree
zpe.thermalcorrgfe: 0.324742 hartree
zpe.sumelectzpe: -1540.849553 hartree
zpe.sumelectthermal: -1540.823600 hartree
zpe.sumelectthermalent: -1540.822656 hartree
zpe.sumelectthermalfe: -1540.910430 hartree
dipole: 0.2053 7.5829 3.1818
dipole: 8.2259
quadrupole: -131.4043 -153.5939 -173.7688
quadrupole: 8.5981 14.5764 -6.7435
quadrupole: 21.5180 -0.6716 -20.8465 8.5981 14.5764 -6.7435
hfenergy: -1541.2351712 hartree
pointgroup: C01 [X(C20H22N4O2S1)]
dipole: 0.6433317 3.1710508 0.0661392 debye
polarizability: 455.6233125|-35.4114624|264.3773071|19.3323023|-21.4265867|192.0123085 unknown
InChI: InChI=1S/C20H22N4O2S/c25-19(23-21-15-17-7-3-1-4-8-17)11-13-27-14-12-20(26)24-22-16-18-9-5-2-6-10-18/h1-10,15-16,23-24H,11-14H2
charge 0 multiplicity 1
49 atoms
S  4.677438 -0.884613 -0.938746
O  2.016783 -3.998255 -0.198122
O  2.513043 0.454302 1.571496
N  1.353496 -2.12206 1.0704
N  2.156753 1.99452 -0.162756
N  -0.000854 -2.355145 0.917611
N  0.770085 1.867563 -0.18864
C  4.740288 -2.585014 -0.094601
C  5.260281 0.213243 0.499452
C  3.72259 -2.760541 1.046369
C  4.459338 1.528266 0.523825
C  2.291208 -3.023118 0.551817
C  2.9586 1.260666 0.703534
C  -2.274364 -1.666469 1.390177
C  -1.300933 2.598301 -1.258147
C  -0.819246 -1.465818 1.446047
C  0.15096 2.634492 -1.065359
C  -3.130454 -0.753037 2.066496
C  -1.89878 3.542207 -2.139841
C  -2.853857 -2.760043 0.683101
C  -2.124969 1.639903 -0.603432
C  -4.53152 -0.9278 2.042818
C  -3.2925 3.534332 -2.356204
C  -4.251285 -2.928202 0.658499
C  -3.514566 1.631564 -0.825346
C  -5.098241 -2.015049 1.337511
C  -4.103719 2.579299 -1.699677
H  4.535464 -3.306417 -0.903861
H  5.77289 -2.735433 0.263399
H  6.338012 0.414929 0.386486
H  5.08916 -0.340826 1.436047
H  3.756719 -1.911428 1.752243
H  4.0094 -3.666951 1.617755
H  4.655666 2.113342 -0.395043
H  4.803971 2.141387 1.380984
H  1.694883 -1.225343 1.474457
H  2.625724 2.605249 -0.84965
H  -0.453897 -0.55825 1.965604
H  0.709371 3.346934 -1.709947
H  -2.693634 0.089063 2.618937
H  -1.269528 4.280689 -2.653205
H  -2.186181 -3.457872 0.167696
H  -1.659667 0.902555 0.055882
H  -5.178173 -0.222114 2.576625
H  -3.744472 4.264903 -3.035827
H  -4.687167 -3.772313 0.112078
H  -4.13469 0.881086 -0.323571
H  -6.185154 -2.153517 1.319051
H  -5.185575 2.567236 -1.872522
