program: Gaussian 09
title: 000228405
version: EM64L-G09RevD.01
frameworkgroup: C1[X(C10H18O3)]
method: RPBEPBE
basis: SDD
operation: Freq
keyword: #pfreq=noraman
keyword: PBEPBE/SDD
title: #p freq=noraman PBEPBE/SDD
converged: YES YES NO NO
title: Mulliken charges:
elementType: O O O C C C C C C C C C C H H H H H H H H H H H H H H H H H H
charge: -0.451941 -0.417215 -0.257070 -0.003214 0.203454 -0.465198 -0.464615 -0.412012 -0.414384 -0.384689 -0.429756 -0.732930 0.120867 0.217407 0.194998 0.217603 0.206552 0.201961 0.201527 0.196054 0.196424 0.201445 0.201175 0.191991 0.210967 0.228564 0.233105 0.217001 0.247807 0.363353 0.380768
chargesum: 0.00000
title: Mulliken charges with hydrogens summed into heavy atoms:
elementType: O O O C C C C C C C C C C
charge: -0.088587 -0.036447 -0.257070 0.214194 0.203454 -0.052598 -0.056102 -0.014431 -0.016516 0.008477 0.009775 -0.035017 0.120867
polarizability: 1.28423676e+02 2.41578066e+00 1.09998949e+02 -2.81287327e+00 -1.38105666e+00 1.01587822e+02
1716.lowfreq: -22.9261 -15.0708 0.0001 0.0006 0.0008 6.2054 37.4194 63.2674 92.9638
frequency: 35.3113 63.0816 92.8671 122.5647 156.4376 188.3429 190.3297 211.7283 244.1460 257.8319 295.4443 310.0642 335.9846 354.2458 400.1640 430.0352 467.9936 487.0011 527.4090 574.4054 596.1225 643.3026 707.9022 728.0060 786.2415 792.2525 841.9341 858.8929 888.5248 895.8839 919.0191 932.3414 945.0882 989.1126 1011.4415 1037.1718 1053.5849 1057.8452 1066.2046 1096.8763 1110.8106 1128.5948 1139.8380 1181.2710 1186.9938 1232.0528 1251.0906 1262.1218 1266.8303 1292.8728 1310.4640 1317.2101 1331.3720 1337.1144 1338.2945 1340.9441 1350.5012 1362.4751 1374.2850 1390.7009 1457.0182 1460.8686 1462.2204 1463.8291 1468.4109 1472.1526 1478.2232 1486.9871 1620.2749 2964.1871 2965.8880 2967.3735 2967.8661 2968.9430 2977.3130 2982.4736 2996.0562 3024.8539 3028.2029 3031.8073 3037.6281 3046.4513 3085.3849 3093.7203 3104.9642 3496.0755 3507.2105
redmass: 3.4232 5.8676 3.4531 3.4616 3.3331 2.4873 1.4507 2.0513 3.1894 2.4458 2.7504 3.5960 2.0253 3.7007 3.4949 3.0280 2.3059 1.9792 2.1800 1.2981 1.3799 2.7107 3.2421 4.5950 1.4690 2.5142 2.2656 1.8235 1.7761 1.6787 1.9851 1.7418 2.0164 3.6765 2.3218 2.4431 1.9153 1.3769 1.3886 2.0178 2.4750 1.6199 2.7211 2.2976 1.4065 1.4730 1.4058 1.2721 1.2742 2.1115 1.3265 1.3979 1.3495 1.3795 1.4345 1.4781 1.2752 1.4301 1.1775 1.1980 1.0754 1.0896 1.0850 1.0856 1.0769 1.0811 1.0915 1.0547 7.9074 1.0689 1.0611 1.0658 1.0648 1.0623 1.0708 1.0661 1.0347 1.0972 1.0953 1.1010 1.1007 1.1025 1.0974 1.0986 1.1014 1.0650 1.0639
irintensity: 0.0747 0.5436 0.7453 2.9806 4.8476 0.8289 1.3149 0.1270 0.6047 0.0904 1.0775 0.8090 2.9622 5.1747 2.1052 0.0363 1.8762 1.8195 14.5501 243.7000 83.2400 28.5489 2.2894 32.1751 0.1624 2.9787 6.5557 3.3809 5.8576 9.5348 2.4997 16.8955 3.7915 116.6693 56.5614 160.6095 3.5741 6.5811 3.9473 15.3193 0.0683 13.3508 0.9429 6.5820 2.8217 28.4405 0.1710 4.8917 5.2685 30.9029 1.3782 5.8898 7.4994 1.8253 3.9089 0.1444 13.7560 0.6060 27.0175 14.5960 3.8505 3.6150 3.1270 5.3857 23.4277 11.7708 0.6658 20.2154 204.7237 33.7192 26.1764 18.3591 32.7901 13.5380 46.3164 40.8276 14.3198 77.1519 71.7401 11.5410 17.6285 129.6691 15.5048 26.0815 14.4181 39.4039 17.3908
temp: 298.150 k
press: 1.00000 atm
elementType: 8 8 8 6 6 6 6 6 6 6 6 6 6 1 1 1 1 1 1 1 1 1 1 1 1 1 1 1 1 1 1
symmnumber: 1
zpe: 704094.2 jmol-1
zpe.correction: 0.268175 hartree
zpe.thermalcorrener: 0.282031 hartree
zpe.thermalcorrenthalpy: 0.282975 hartree
zpe.thermalcorrgfe: 0.228016 hartree
zpe.sumelectzpe: -616.487267 hartree
zpe.sumelectthermal: -616.473412 hartree
zpe.sumelectthermalent: -616.472468 hartree
zpe.sumelectthermalfe: -616.527427 hartree
dipole: -2.4965 1.6387 1.4143
dipole: 3.3042
quadrupole: -85.8191 -78.9024 -81.0965
quadrupole: 7.1254 5.8294 0.2790
quadrupole: -3.8798 3.0370 0.8428 7.1254 5.8294 0.2790
hfenergy: -616.7554423 hartree
pointgroup: C01 [X(C10H18O3)]
dipole: 0.9352434 -0.7110343 0.5565048 debye
polarizability: 128.5073904|1.3030597|109.7230961|3.4399053|1.4623003|101.7799601 unknown
InChI: InChI=1S/C10H18O3/c1-10(7-11,9(12)13)8-5-3-2-4-6-8/h8,11-12H,2-7H2,1H3
charge 0 multiplicity 1
31 atoms
O  -2.629448 1.721708 -1.146528
O  -1.565247 -1.72249 1.125575
O  -2.607877 -1.059923 -0.821702
C  0.588552 0.04812 0.330273
C  -0.934073 0.462331 0.23634
C  1.050655 -0.881521 -0.827517
C  1.554076 1.260102 0.434246
C  2.504697 -1.364959 -0.608954
C  3.010833 0.786032 0.663985
C  3.478862 -0.173692 -0.454669
C  -1.215512 1.37466 -0.997753
C  -1.404954 1.182316 1.536326
C  -1.778779 -0.807446 0.090734
H  0.68262 -0.534015 1.271371
H  0.993683 -0.339768 -1.793669
H  0.379566 -1.758558 -0.912212
H  1.253622 1.93441 1.257849
H  1.518236 1.853811 -0.501889
H  2.818058 -2.010287 -1.452444
H  2.544241 -1.991209 0.306423
H  3.074452 0.266638 1.642651
H  3.684823 1.662687 0.722889
H  4.501965 -0.539926 -0.242169
H  3.53032 0.382653 -1.413739
H  -0.833332 0.894859 -1.921485
H  -0.700361 2.338506 -0.857228
H  -1.272386 0.534157 2.41895
H  -0.825952 2.10987 1.685012
H  -2.466819 1.469532 1.448438
H  -3.104443 0.880299 -1.38345
H  -2.158075 -2.511397 0.991042
