program: Gaussian 09
title: 000021589
version: EM64L-G09RevD.01
frameworkgroup: C1[X(C10H11N3O)]
method: RPBEPBE
basis: SDD
operation: Freq
keyword: #p
keyword: freq=noraman
keyword: PBEPBE/SDD
title: #p freq=noraman PBEPBE/SDD
converged: YES YES NO NO
title: Mulliken charges:
elementType: O N N N C C C C C C C C C C H H H H H H H H H H H
charge: -0.274138 -0.404327 -0.365920 -0.511388 0.317087 0.131881 0.225160 -0.630904 -0.413209 -0.407398 -0.343003 -0.247443 -0.215461 0.177703 0.251647 0.248836 0.273070 0.307680 0.241845 0.229357 0.223623 0.223966 0.356002 0.301989 0.303345
chargesum: 0.00000
title: Mulliken charges with hydrogens summed into heavy atoms:
elementType: O N N N C C C C C C C C C C
charge: -0.274138 -0.096647 -0.009919 0.093947 0.317087 0.131881 0.225160 -0.130421 -0.140139 -0.165552 -0.113646 -0.023820 0.008506 0.177703
polarizability: 1.56321348e+02 -1.10166254e+01 1.39968641e+02 1.79345481e+01 8.73941372e+00 8.88924977e+01
1716.lowfreq: -7.9987 -6.3577 -0.0007 -0.0006 0.0002 7.5198 22.4840 36.3916 66.9186
frequency: 21.6277 36.1989 66.9066 108.5919 163.6969 176.2134 216.1818 228.2476 258.3914 338.3844 363.1283 424.1659 446.4789 519.2696 527.8205 560.7023 574.9512 586.5120 606.6231 635.8524 667.1146 742.9363 751.7819 751.9450 771.0125 785.4694 807.9874 854.6276 867.1632 921.2367 933.4681 936.5390 975.6835 1012.2111 1064.3896 1097.0301 1131.4422 1139.5331 1166.0574 1182.2603 1231.6495 1254.3412 1258.4977 1284.4965 1286.5152 1307.9270 1349.6132 1390.4122 1421.3507 1437.0157 1454.2984 1458.8074 1482.9210 1561.1611 1587.7347 1613.0960 1632.5570 1678.6552 2999.3131 3051.9004 3126.0875 3133.7294 3147.2258 3164.5097 3219.5613 3386.7807 3501.1908 3541.2062 3611.6663
redmass: 5.6860 4.7735 4.9042 1.3747 4.4950 2.4513 3.3715 2.4797 4.2810 6.1142 8.0311 2.8624 3.1236 1.2931 4.4619 3.0710 3.2728 3.3725 4.4713 1.2911 3.5287 3.6824 1.4012 4.3261 2.9572 1.7455 1.6996 1.4721 5.1465 2.6964 3.7607 1.3968 1.3016 2.1487 3.9432 1.6012 1.5984 3.0935 1.1387 1.2266 2.0602 1.7111 1.9854 1.5134 1.2311 2.0088 1.8477 5.0949 2.4159 1.2929 1.4749 3.7718 3.0312 6.0910 6.1941 8.7199 6.9068 1.0630 1.0607 1.0996 1.0850 1.0892 1.0955 1.1002 1.0984 1.0429 1.0982 1.0793 1.0810
irintensity: 1.1556 0.9242 0.2064 27.3452 1.0288 7.7233 12.2103 5.2623 9.5359 22.9210 1.0750 13.4590 1.8908 86.6225 10.6300 44.9521 5.2336 13.7148 6.0538 70.2279 7.0504 4.1424 99.8624 13.5559 66.7150 56.2726 19.5586 0.4714 0.8538 7.3113 5.7294 3.1895 0.0061 10.1679 5.3991 38.8037 0.8149 5.1980 2.3377 2.6612 22.6425 13.7684 19.6561 2.9868 0.8141 3.1252 19.5391 35.4386 5.4438 109.1268 45.2489 19.3044 1.8043 1.8648 1.3635 278.9610 2.7301 19.6627 18.6330 4.6268 0.8392 4.4460 32.3867 25.2269 0.5222 0.0876 1.2924 32.7280 64.6763
temp: 298.150 k
press: 1.00000 atm
elementType: 8 7 7 7 6 6 6 6 6 6 6 6 6 6 1 1 1 1 1 1 1 1 1 1 1
symmnumber: 1
zpe: 520340.0 jmol-1
zpe.correction: 0.198187 hartree
zpe.thermalcorrener: 0.210831 hartree
zpe.thermalcorrenthalpy: 0.211775 hartree
zpe.thermalcorrgfe: 0.157547 hartree
zpe.sumelectzpe: -626.130481 hartree
zpe.sumelectthermal: -626.117837 hartree
zpe.sumelectthermalent: -626.116893 hartree
zpe.sumelectthermalfe: -626.171121 hartree
dipole: 3.3155 2.6503 1.8648
dipole: 4.6362
quadrupole: -85.0786 -67.2064 -87.7314
quadrupole: 1.6736 -1.5153 3.4904
quadrupole: -5.0731 12.7991 -7.7259 1.6736 -1.5153 3.4904
hfenergy: -626.3286682 hartree
pointgroup: C01 [X(C10H11N3O1)]
dipole: 1.2580937 -0.8665429 -0.9966439 debye
dipolederiv: -0.983672 0.0584898 0.4217144 0.265759 -0.4176414 -0.0850443 0.1866278 0.0684037 -0.7426789 -0.5808043 0.2163242 0.1833095 -0.1510762 -0.443611 -0.0099799 0.1317693 -0.2027841 -0.3798416 -0.2042121 -0.1412537 0.1039056 -0.1661169 -0.3302393 0.0698176 0.0046058 0.1402373 -0.7664838 -0.1185716 0.0017849 0.1102151 0.0505609 -0.0587992 0.0661463 -0.0154579 0.0925349 -0.4396734 0.0533177 0.0061254 -0.0972191 0.1782878 -0.1559664 -0.0414463 -0.1675588 0.0573631 -0.0983349 0.0485104 0.2820142 0.1105686 0.0722632 -0.0017946 -0.0154945 0.0029265 -0.1645943 -0.0832938 -0.1434925 -0.0767652 0.0521773 0.1932875 0.4330573 0.094681 0.1855711 0.211027 0.040332 -0.0460788 0.1218423 -0.0509493 0.2104361 -0.019458 0.0600533 -0.1592921 0.0666528 0.0418431 0.3028414 -0.2526696 -0.3515547 -0.117758 -0.0946823 0.0787394 -0.3605638 0.1651112 0.0575327 0.016025 0.0115523 -0.0933637 0.0684524 0.0570981 0.0489263 -0.0836014 0.0867637 -0.0765413 0.0431185 0.0280794 -0.1226003 0.0687509 -0.0285685 0.0295183 -0.1022541 0.0548849 -0.0983866 -0.1560104 -0.0429065 -0.036743 -0.0077877 0.0354126 0.0975651 -0.0184328 0.1201875 -0.1151731 0.0159046 0.052409 -0.1001304 -0.027717 -0.0790432 0.0533657 -0.1299108 0.0118606 -0.0933083 0.9933866 -0.182141 -0.4252879 -0.4122671 0.3636999 -0.1545217 -0.2190223 -0.2719042 1.2448795 0.010037 0.011357 -0.018796 0.0187018 0.0846587 -0.094528 0.0313991 -0.0384794 -0.05121 -0.0112223 -0.032514 0.0265686 -0.0642867 -0.0674193 0.0516883 0.0202101 -0.0162554 0.0980537 0.0997698 -0.0687094 0.0352355 -0.0724993 0.0051879 -0.0427704 0.0328761 -0.0388316 0.1571704 0.191246 -0.0433461 0.0677539 -0.0631879 0.2317631 -0.0206675 0.0679534 -0.0257199 0.2895912 0.0079359 0.0508914 0.1098546 0.0312185 0.0732173 -0.0396695 0.104536 -0.0599873 0.0662383 -0.003419 0.021729 0.1114274 0.0536277 0.0595968 -0.0828794 0.1303864 -0.0645477 0.070248 0.0952414 -0.033291 0.023157 -0.0464506 -0.0981223 -0.0958464 0.0208901 -0.0964603 0.105788 -0.0425396 -0.1125049 0.0674007 -0.1197572 0.0255284 0.0067923 0.069398 0.0062338 0.1257005 0.2554656 0.0744563 0.0067513 0.0342998 0.2154788 0.0274951 0.111741 0.0300145 0.1639387 0.1190579 0.0696129 -0.09829 0.0249086 0.1032424 -0.0678261 0.013228 -0.1829143 0.196225 0.0381646 -0.0205667 -0.0351051 -0.0216497 0.1074041 0.0658853 0.1419754 0.0512035 0.2873846 unknown
polarizability: 150.5655777|15.5848019|138.4559958|-23.307413|12.4302654|96.1609134 unknown
InChI: InChI=1S/C10H11N3O/c11-13-10(14)5-7-6-12-9-4-2-1-3-8(7)9/h1-4,6,12-13H,5,11H2
charge 0 multiplicity 1
25 atoms
O  -3.769757 0.181937 1.573142
N  1.359879 -1.789473 -0.735185
N  -2.634841 0.273392 -0.45201
N  -3.631987 1.029458 -1.127714
C  -0.334427 -1.035762 0.607352
C  0.664964 0.016265 0.479869
C  1.714795 -0.484682 -0.368851
C  -1.600432 -0.979871 1.423238
C  0.130444 -2.116536 -0.145568
C  0.773772 1.331551 1.005832
C  2.852296 0.2840 -0.701366
C  1.906224 2.102181 0.680307
C  2.933461 1.584698 -0.164569
C  -2.757102 -0.117607 0.870909
H  -1.401456 -0.59029 2.439111
H  -2.016852 -1.994778 1.567616
H  -0.321666 -3.095939 -0.294705
H  1.908916 -2.405106 -1.330667
H  -0.009864 1.740612 1.653501
H  3.644628 -0.108078 -1.348737
H  2.005548 3.117742 1.078988
H  3.80123 2.210883 -0.399799
H  -1.80454 0.030217 -0.995617
H  -3.71898 1.965068 -0.703879
H  -4.536754 0.538716 -1.078199
