program: Gaussian 09
title: 000228402
version: EM64L-G09RevD.01
frameworkgroup: C1[X(C6H12N2O)]
method: RPBEPBE
basis: SDD
operation: Freq
keyword: #p
keyword: freq=noraman
keyword: PBEPBE/SDD
title: #p freq=noraman PBEPBE/SDD
converged: YES YES NO NO
title: Mulliken charges:
elementType: O N N C C C C C C H H H H H H H H H H H H
charge: -0.273021 -0.073275 -0.315887 -0.320244 -0.364304 -0.397574 -0.450768 0.139615 -0.620439 0.191941 0.202437 0.216741 0.197707 0.230151 0.213703 0.224337 0.237452 0.318421 0.193958 0.227007 0.222040
chargesum: 0.00000
title: Mulliken charges with hydrogens summed into heavy atoms:
elementType: O N N C C C C C C
charge: -0.273021 -0.073275 0.002534 0.074135 0.050144 0.046279 0.011022 0.139615 0.022567
polarizability: 9.24920205e+01 4.42550849e+00 8.25865614e+01 3.16574499e+00 -7.75438290e-02 6.13719266e+01
1716.lowfreq: -8.8615 -0.0005 -0.0004 0.0010 7.6318 19.6426 82.5823 131.4754 196.2763
frequency: 82.4775 131.4667 196.2601 223.6987 264.7877 310.5409 330.9909 360.7086 385.3254 472.1081 500.4063 567.7971 596.6991 694.5599 705.4929 775.5659 879.4371 923.7815 958.9268 993.6061 1037.7329 1061.3907 1069.3310 1110.8820 1122.6926 1141.8020 1174.0968 1203.0043 1241.6501 1293.3090 1299.9557 1313.9805 1340.2503 1353.2213 1373.7316 1385.2322 1414.8798 1432.8558 1443.6845 1453.0238 1464.2593 1468.7984 1476.0577 1484.8444 1626.9004 2847.9395 2856.4522 2873.7520 2985.6186 3000.6796 3017.9360 3019.8602 3030.6595 3063.1070 3077.7660 3090.1953 3532.6409
redmass: 4.3085 2.8214 2.3609 1.1847 2.1501 3.6434 2.6277 2.0267 3.1060 2.7597 2.3144 2.3021 1.3736 3.1749 3.3121 3.3080 2.1508 2.1997 2.1416 2.1621 1.8468 2.4053 2.3041 1.6597 1.8748 2.5750 1.2509 1.5183 1.4882 1.5367 1.5186 1.3798 1.3606 1.3328 1.3571 1.6665 1.7463 1.1834 1.1166 1.0860 1.0537 1.1435 1.1167 1.0565 5.4475 1.0701 1.0669 1.0597 1.0640 1.0639 1.0884 1.0741 1.0890 1.0988 1.1008 1.0975 1.0767
irintensity: 2.4029 1.4170 1.0648 0.2329 4.0514 5.8776 3.7386 4.0536 3.9005 5.6545 3.0672 21.5608 77.6754 4.7981 25.4524 0.2992 3.5318 13.6599 14.3244 11.0793 10.8110 3.6528 14.4440 20.9075 11.1884 17.1091 21.4217 1.1980 17.9421 44.0737 4.2768 9.5050 20.4106 16.0407 10.3505 38.1514 20.2288 2.6146 32.2938 5.5276 20.0213 21.4424 19.9804 11.7725 329.5073 58.7415 47.0696 201.9808 31.1941 16.6033 41.5245 50.3080 37.4752 29.5461 35.3408 12.6881 16.8567
temp: 298.150 k
press: 1.00000 atm
elementType: 8 7 7 6 6 6 6 6 6 1 1 1 1 1 1 1 1 1 1 1 1
symmnumber: 1
zpe: 475747.7 jmol-1
zpe.correction: 0.181203 hartree
zpe.thermalcorrener: 0.190135 hartree
zpe.thermalcorrenthalpy: 0.191079 hartree
zpe.thermalcorrgfe: 0.147759 hartree
zpe.sumelectzpe: -419.830560 hartree
zpe.sumelectthermal: -419.821628 hartree
zpe.sumelectthermalent: -419.820684 hartree
zpe.sumelectthermalfe: -419.864004 hartree
dipole: 3.9604 2.2628 0.2925
dipole: 4.5706
quadrupole: -66.4216 -48.3853 -56.3874
quadrupole: -6.1925 -3.8425 -1.7337
quadrupole: -9.3569 8.6794 0.6774 -6.1925 -3.8425 -1.7337
hfenergy: -420.0117627 hartree
pointgroup: C01 [X(C6H12N2O1)]
dipole: 1.5853934 0.845301 0.0743904 debye
dipolederiv: -1.0965953 -0.332286 -0.1493897 -0.1709226 -0.6707084 -0.0027858 -0.29015 -0.0865465 -0.4298875 -0.6348269 0.0265458 0.0914927 0.026095 -0.5250412 -0.0174385 0.0245417 -0.0070132 -0.5659014 -0.574569 -0.1184166 0.0621209 -0.5179754 -0.9195749 -0.128821 0.1443739 0.0274602 -0.4229089 0.0567521 -0.1127048 0.0666433 -0.1204385 0.4141227 -0.1048212 0.0891891 -0.1157791 0.3793761 0.3610652 0.1670237 0.0512845 0.2256683 0.293126 0.0744473 0.0176042 0.0819797 0.3777346 0.4955121 0.1699479 0.0519413 0.1636696 0.2154377 0.0284855 0.0478632 0.0664439 0.2899134 -0.2447696 0.1124714 -0.0686335 0.0719621 -0.0188358 0.0795479 -0.0723116 0.0741874 0.0503849 1.1600722 0.3269248 0.2911785 0.4926432 1.3056751 -0.0217515 0.3511135 -0.0893517 0.2459939 0.4448784 -0.0889996 -0.0941233 -0.0916525 0.1067874 0.0472745 -0.1128266 0.047564 0.3761698 0.0298506 0.0706602 -0.0454558 0.0468379 -0.0347036 -0.0394226 -0.0366771 0.1207382 -0.2600802 -0.1041521 -0.1514857 -0.0283317 -0.0879105 -0.0457909 -0.0127096 -0.0493101 -0.0302293 0.0677649 -0.0278258 0.1217496 -0.032484 0.0708615 -0.1209063 0.0350736 -0.0313718 0.0553846 0.0590134 -0.0322564 -0.0711245 -0.0129363 -0.0501888 0.0174535 0.0245481 -0.0662807 -0.1158554 -0.2362365 -0.0124545 -0.0616479 -0.0212163 -0.0359379 0.0950765 0.0685389 -0.0363423 -0.040085 -0.1492578 0.0165977 0.0335395 -0.0106007 0.0081523 -0.1614651 0.0118822 -0.0116664 0.0708076 0.0996503 0.0759617 0.0286824 -0.0588534 0.0494807 0.0664741 -0.0971689 -0.0193174 -0.0325081 -0.0903184 0.0045698 -0.0811826 0.0196417 -0.0534433 -0.0630206 0.0235618 -0.0038891 -0.019306 0.1054905 0.1211618 -0.0253847 -0.0748786 -0.0255962 0.1243375 0.0312272 -0.0932146 0.0317884 0.2766372 -0.0450807 0.0255744 -0.0162728 0.0413323 0.0621841 -0.0240574 0.1860552 -0.0681049 -0.2752806 0.0579358 0.0443627 -0.0003943 0.1370148 -0.1080309 0.0847303 -0.0141136 0.0943433 0.0395002 -0.0518268 -0.0842499 -0.0207326 -0.1796521 -0.0325972 -0.0603407 -0.0232695 -0.0659181 0.0622421 unknown
polarizability: 92.8568578|4.1505131|82.3303336|2.4794779|-0.4639424|61.2633172 unknown
InChI: InChI=1S/C6H12N2O/c1-8-4-2-6(9)7-3-5-8/h7H,2-5H2,1H3
charge 0 multiplicity 1
21 atoms
O  -2.845868 -0.587602 -0.412103
N  1.615443 -0.18659 0.177586
N  -1.325598 1.128572 -0.093463
C  1.20507 1.149084 -0.311829
C  0.648904 -1.272527 -0.124625
C  -0.055905 1.700278 0.388321
C  -0.695592 -1.154225 0.637648
C  -1.712307 -0.199317 0.008795
C  2.979464 -0.534518 -0.277862
H  1.035367 1.165226 -1.419816
H  2.039588 1.843905 -0.095465
H  1.128703 -2.219136 0.185808
H  0.443521 -1.357275 -1.222658
H  0.05856 1.547409 1.479697
H  -0.104956 2.789377 0.209706
H  -0.474486 -0.859022 1.681802
H  -1.189473 -2.139646 0.658405
H  -2.017189 1.748593 -0.522033
H  3.067222 -0.644599 -1.387928
H  3.292021 -1.487981 0.184066
H  3.689811 0.248292 0.043649
