program: Gaussian 09
title: 000228385
version: EM64L-G09RevD.01
frameworkgroup: C1[X(C22H18N2O2)]
method: RPBEPBE
basis: SDD
operation: Freq
keyword: #p
keyword: freq=noraman
keyword: PBEPBE/SDD
title: #p freq=noraman PBEPBE/SDD
converged: YES YES NO NO
title: Mulliken charges:
elementType: O O N N C C C C C C C C C C C C C C C C C C C C C C H H H H H H H H H H H H H H H H H H
charge: -0.262910 -0.262909 -0.115365 -0.115370 0.207556 0.207555 -0.068584 -0.068581 0.350923 0.350934 -0.378454 -0.378460 -0.251985 -0.252003 -0.380354 -0.382455 -0.382440 -0.380358 -0.360506 -0.368173 -0.368157 -0.360506 0.317658 0.317660 -0.537584 -0.537584 0.274005 0.274015 0.233964 0.233965 0.270194 0.264047 0.264032 0.270201 0.241924 0.252173 0.252173 0.241925 0.222705 0.246097 0.225115 0.222706 0.225115 0.246097
chargesum: 0.00000
title: Mulliken charges with hydrogens summed into heavy atoms:
elementType: O O N N C C C C C C C C C C C C C C C C C C C C C C
charge: -0.262910 -0.262909 -0.115365 -0.115370 0.207556 0.207555 -0.068584 -0.068581 0.350923 0.350934 -0.104448 -0.104445 -0.018021 -0.018038 -0.110160 -0.118409 -0.118407 -0.110157 -0.118583 -0.116000 -0.115984 -0.118581 0.317658 0.317660 0.156332 0.156333
polarizability: 5.35006721e+02 -2.38771067e-04 2.63734728e+02 1.48958058e-03 2.23330638e+01 1.43428437e+02
1716.lowfreq: -3.9143 -0.0008 0.0002 0.0013 1.0245 3.8433 22.0523 36.3303 39.9241
frequency: 21.7910 36.2910 39.9096 62.4171 75.2483 80.8925 92.5306 108.8188 142.2966 159.8644 168.0485 188.1641 191.1454 217.6774 220.7737 230.9387 255.8828 296.7252 306.8191 334.6476 361.4934 415.3090 415.3475 421.6028 430.5605 437.1375 456.5974 469.1093 506.4035 510.8459 520.2694 547.5030 558.5060 576.0049 620.0934 624.8652 642.9699 654.4252 667.2398 674.4364 733.8426 734.6240 766.0457 775.3073 785.3293 786.3832 800.3922 819.8528 820.9056 838.2944 841.3416 893.1749 909.4206 951.4368 951.7643 963.0104 967.3870 971.2044 984.3507 985.8566 987.8328 1002.3928 1004.9539 1006.7780 1011.4650 1042.2540 1112.3447 1112.3978 1112.4612 1114.6696 1119.4969 1157.2931 1157.3980 1166.0305 1174.1082 1178.9336 1181.0507 1208.0403 1229.1730 1233.9308 1237.8531 1260.0373 1301.9627 1303.5149 1336.1683 1346.1501 1372.0353 1375.8864 1386.0495 1410.1118 1422.8382 1423.7694 1437.7301 1437.7820 1467.2144 1467.2226 1470.7981 1472.2302 1473.0854 1479.2218 1505.8705 1507.3851 1554.2010 1571.8301 1572.9019 1613.3418 1618.7733 1618.9750 2962.8800 2963.0559 3052.2738 3052.2883 3127.1040 3127.1309 3132.5412 3139.4210 3139.6261 3149.8445 3153.3332 3153.3810 3167.2717 3167.8762 3170.0468 3174.0647 3174.1703 3176.1792
redmass: 6.4546 4.6068 3.6015 4.2178 4.3728 4.7300 3.8293 3.9076 5.1588 4.2975 5.6995 3.2096 3.3188 1.5959 4.4200 1.3563 2.5041 4.9793 4.1239 6.1805 5.5963 3.0721 3.9898 4.6484 3.6271 4.8217 4.1849 4.5112 4.0728 4.2625 4.7864 4.0626 6.0061 3.9126 6.7535 5.9225 6.4665 3.9031 4.9605 6.1013 3.4960 4.1315 5.6334 6.3272 1.4649 6.4233 3.8371 1.2812 1.2992 1.6204 1.8279 1.4669 6.7822 1.3761 1.4245 1.3584 1.5065 4.0051 2.9204 8.4867 1.9903 3.0855 2.5853 1.3162 4.5170 2.2894 1.3820 1.2597 1.4067 1.3957 2.0685 1.3437 1.3475 2.1522 1.2848 1.2966 1.2515 2.9196 3.2573 2.9615 3.9251 1.6453 1.3018 1.3570 3.2508 3.2251 6.0259 5.0015 3.0550 7.3546 3.6556 3.6987 1.1910 1.2075 1.0515 1.0501 2.3050 1.1107 1.3410 2.3918 2.9001 2.9087 6.8834 7.2388 7.2845 6.1119 6.3742 6.3179 1.0327 1.0328 1.1041 1.1041 1.0997 1.0997 1.0863 1.0886 1.0886 1.0908 1.0875 1.0875 1.0951 1.0958 1.0944 1.0965 1.0964 1.0982
irintensity: 1.6960 1.1025 0.0584 0.9263 6.6435 2.8129 2.2750 0.0013 10.7936 0.9447 0.4140 1.1232 0.7841 0.9931 0.0329 0.8163 5.6809 3.9437 0.1688 0.3899 1.6427 1.2623 3.3748 0.1304 0.9358 0.0296 1.9154 0.5347 13.4044 11.1349 46.1487 7.3023 7.9105 8.0649 4.9083 11.9929 13.1379 45.7818 0.7097 2.2865 16.5385 0.1270 2.9145 23.7243 40.7671 5.1028 4.4775 10.0128 20.3009 124.6518 2.0742 1.0012 1.3062 0.9780 1.2742 0.8833 0.0063 25.9480 16.9719 66.5029 22.0723 0.5393 18.9016 1.3199 19.9998 1.1153 0.0760 0.3372 0.6969 17.7289 7.3388 0.8802 13.1733 1.2456 0.8635 369.5393 35.1573 11.4814 2.4223 421.3435 35.6606 38.6305 0.1090 2.3810 23.8947 76.4469 17.8138 172.1068 203.6183 26.4184 13.4509 0.4172 3.8154 8.5230 4.9016 23.5504 22.6189 10.2321 78.3781 0.6348 5.1274 110.8189 8.2350 34.5314 3.3129 75.2044 22.5624 327.5074 101.4424 78.5292 2.7562 87.8235 54.8619 4.7256 3.2988 8.4839 15.0236 12.6668 15.2126 5.2181 0.0274 13.2946 7.7100 9.1162 15.4358 15.1982
temp: 298.150 k
press: 1.00000 atm
elementType: 8 8 7 7 6 6 6 6 6 6 6 6 6 6 6 6 6 6 6 6 6 6 6 6 6 6 1 1 1 1 1 1 1 1 1 1 1 1 1 1 1 1 1 1
symmnumber: 1
zpe: 896971.7 jmol-1
zpe.correction: 0.341638 hartree
zpe.thermalcorrener: 0.363515 hartree
zpe.thermalcorrenthalpy: 0.364459 hartree
zpe.thermalcorrgfe: 0.289685 hartree
zpe.sumelectzpe: -1107.245410 hartree
zpe.sumelectthermal: -1107.223534 hartree
zpe.sumelectthermalent: -1107.222590 hartree
zpe.sumelectthermalfe: -1107.297364 hartree
dipole: 0.0001 1.4000 -1.6881
dipole: 2.1931
quadrupole: -107.1607 -134.5970 -152.3381
quadrupole: -0.0007 0.0013 6.4617
quadrupole: 24.2046 -3.2317 -20.9728 -0.0007 0.0013 6.4617
hfenergy: -1107.5870488 hartree
pointgroup: C01 [X(C22H18N2O2)]
dipole: 0.0000543 -0.7690734 0.3911363 debye
polarizability: 535.0067212|0.0020934|228.5345736|0.0040974|59.1144222|178.6285917 unknown
InChI: InChI=1S/C22H18N2O2/c1-25-17-11-7-15(8-12-17)21-19-5-3-4-6-20(19)22(24-23-21)16-9-13-18(26-2)14-10-16/h3-14H,1-2H3
charge 0 multiplicity 1
44 atoms
O  -7.015261 0.914002 -0.105045
O  7.015195 0.914064 -0.104773
N  -0.692236 0.917993 0.910098
N  0.692099 0.918031 0.910109
C  -0.723287 -1.298515 -0.150222
C  0.723278 -1.298472 -0.150214
C  -1.389289 -0.094091 0.313152
C  1.38921 -0.094023 0.313179
C  -2.854596 0.134136 0.223508
C  2.854515 0.134223 0.223606
C  -1.41795 -2.503708 -0.491267
C  1.418029 -2.503604 -0.491285
C  -0.713404 -3.657528 -0.847626
C  0.713565 -3.657475 -0.847642
C  -3.51625 0.839012 1.262708
C  3.619663 -0.260513 -0.912342
C  -3.619671 -0.260458 -0.912541
C  3.516101 0.839209 1.262774
C  -4.896545 1.114972 1.201894
C  4.994421 0.016182 -0.992058
C  -4.994425 0.016239 -0.992311
C  4.896399 1.115172 1.202013
C  -5.642309 0.697346 0.069488
C  5.642234 0.697422 0.069699
C  -7.728289 1.6396 0.950545
C  7.728153 1.639791 0.950775
H  -2.509158 -2.527118 -0.43058
H  2.509242 -2.526923 -0.430627
H  -1.257165 -4.574875 -1.098294
H  1.257391 -4.574779 -1.098326
H  -2.923293 1.176067 2.118063
H  3.127811 -0.747071 -1.761369
H  -3.127762 -0.746885 -1.761609
H  2.923091 1.176356 2.118056
H  -5.37355 1.651062 2.027673
H  5.583293 -0.270033 -1.868604
H  -5.583239 -0.269866 -1.868931
H  5.373349 1.651358 2.027761
H  -7.691232 1.089929 1.910985
H  -8.768636 1.705311 0.600218
H  -7.314771 2.657276 1.087997
H  7.691039 1.090234 1.911278
H  7.31462 2.657481 1.088081
H  8.768522 1.705466 0.600506
