program: Gaussian 09
title: 000228386
version: EM64L-G09RevD.01
frameworkgroup: C1[X(C22H20O4)]
method: RPBEPBE
basis: SDD
operation: Freq
keyword: #pfreq=noraman
keyword: PBEPBE/SDD
title: #p freq=noraman PBEPBE/SDD
converged: YES YES NO NO
title: Mulliken charges:
elementType: O O O O C C C C C C C C C C C C C C C C C C C C C C H H H H H H H H H H H H H H H H H H H H
charge: -0.271597 -0.273570 -0.434239 -0.273636 -0.472181 0.377256 0.488423 0.410026 0.049379 -0.327657 -0.586194 -0.523057 -0.416881 -0.405799 -0.314697 0.330164 0.318510 -0.252125 -0.224417 -0.236283 -0.241513 -0.377157 -0.394027 0.079859 -0.537794 -0.537154 0.294503 0.247087 0.290669 0.270339 0.247674 0.257779 0.275908 0.233689 0.224023 0.222027 0.234945 0.249602 0.242275 0.383054 0.225509 0.224408 0.240622 0.243323 0.220053 0.218876
chargesum: 0.00000
title: Mulliken charges with hydrogens summed into heavy atoms:
elementType: O O O O C C C C C C C C C C C C C C C C C C C C C C
charge: -0.271597 -0.273570 -0.051186 -0.273636 -0.177678 0.377256 0.488423 0.410026 0.049379 -0.080570 -0.295525 -0.252719 -0.169208 -0.148020 -0.038789 0.330164 0.318510 -0.018436 -0.000393 -0.014256 -0.006568 -0.127555 -0.151752 0.079859 0.152744 0.145098
polarizability: 2.91813689e+02 5.39674899e+00 2.62624144e+02 2.41637476e+01 -2.34202870e+00 2.07889986e+02
1716.lowfreq: -8.8303 -3.6610 -2.5944 -0.0007 -0.0002 0.0002 12.8796 24.6693 30.2323
frequency: 12.7505 24.5745 30.2281 47.4570 60.1425 65.7827 68.4132 94.2949 108.8849 126.0451 149.6707 174.9740 180.8148 193.0525 203.0917 221.9281 230.1015 262.1750 264.2265 270.1726 272.5808 299.1548 311.7523 381.6648 410.2277 434.8950 445.9575 449.7149 450.8368 490.0245 514.0902 533.8464 548.2053 552.2133 566.6829 594.8892 601.8310 613.2801 634.9800 658.8764 694.1964 695.3915 704.8224 722.5168 741.9870 763.5203 777.9051 793.6039 795.7816 802.5095 826.6147 874.3999 885.1482 890.2643 897.1822 904.5422 907.9408 936.8310 970.0451 973.2892 976.8843 981.5988 983.9568 998.7329 1001.2255 1002.9082 1020.8159 1048.8717 1079.9486 1092.4492 1099.0240 1110.9860 1112.3749 1140.2458 1156.2333 1157.4614 1160.2173 1168.1437 1173.2787 1180.1627 1185.9455 1194.4511 1231.2227 1242.3125 1250.3987 1267.7129 1298.6953 1301.8740 1319.7446 1327.6072 1384.3287 1386.5715 1390.7943 1424.0428 1428.3312 1431.0552 1442.0852 1444.9306 1465.6058 1465.7197 1469.7166 1474.2004 1475.9809 1476.4451 1485.7859 1573.6658 1584.5978 1598.8688 1603.5686 1606.2767 1618.6137 1624.4743 2956.0568 2962.2561 3033.1221 3042.3403 3050.0178 3122.1118 3123.0347 3126.9875 3129.0857 3132.7563 3147.4717 3150.6748 3153.1949 3155.3285 3159.4763 3163.3333 3167.5028 3169.3021 3182.4263 3522.8443
redmass: 4.9855 5.4098 5.5097 6.3258 6.4914 4.4975 4.5306 3.7209 3.5602 4.0992 4.3240 5.9468 3.3111 2.0605 1.7646 4.7017 3.5365 4.1868 1.8795 1.9758 4.1096 4.0731 4.4001 7.6771 3.3469 4.4799 3.4051 3.4568 4.2900 4.5174 5.0419 4.9988 4.8301 4.8245 4.9438 1.2927 4.9251 4.3076 4.9953 6.0758 3.1222 2.5160 2.6364 3.7543 4.4450 2.1671 1.7846 2.6535 1.6700 2.5784 3.2293 2.5085 1.4931 1.5916 1.6037 1.5736 1.5894 4.1362 1.3524 1.3425 1.3929 5.4015 5.8620 4.8755 1.3894 5.2521 3.6874 2.4184 1.6255 1.9690 1.8823 1.2624 1.2609 1.6794 1.4507 1.5492 1.6895 1.5978 1.1727 1.0698 1.2524 1.8724 1.7973 5.0965 2.3814 1.5633 1.3611 1.8503 1.2765 1.7966 6.9234 6.2285 7.0399 1.8450 1.7236 1.9494 1.6261 1.5540 1.0504 1.0503 1.2184 1.1000 2.4253 2.2185 1.9408 6.3723 6.0397 6.4787 6.2450 6.3446 6.5361 7.4163 1.0331 1.0326 1.0816 1.1038 1.1038 1.0991 1.0999 1.0864 1.0866 1.0861 1.0931 1.0907 1.0921 1.0914 1.0912 1.0963 1.0971 1.0972 1.0968 1.0640
irintensity: 0.0693 0.0913 0.4476 1.5065 2.2455 1.5347 1.6353 5.5117 4.0554 1.0070 1.6383 1.6026 0.1981 0.2603 0.7126 0.8980 4.3891 1.7707 0.8405 0.7189 1.7626 1.6973 4.0504 6.6782 8.7836 0.0719 5.0897 1.9222 1.7227 5.6659 10.8674 5.0840 4.8431 3.9265 0.7319 98.4588 48.5495 7.0748 4.5494 1.3452 16.3775 43.2347 25.6143 82.1953 21.1996 66.7492 7.7578 22.2565 23.7606 17.2587 0.6167 4.2213 2.0950 1.0866 19.8609 1.7267 13.5046 2.2039 1.3265 3.2294 7.0594 1.9398 0.5499 186.7623 1.9073 127.8196 111.3116 12.6127 20.4653 38.0882 25.2062 0.2083 0.2471 32.0035 20.6583 57.3795 16.5987 89.8518 3.7045 1.7379 1.0737 14.8615 33.9237 55.8178 152.0071 12.1533 6.4732 48.9430 0.4889 38.1275 6.5424 10.6403 14.9079 33.2162 23.5733 2.9804 7.0929 15.3808 12.8158 12.3613 102.9251 13.3796 45.3972 66.1589 19.0220 24.6255 76.4915 35.9561 176.3200 20.3931 85.6132 212.6321 79.4026 50.1566 24.6622 48.2723 44.1423 27.2464 33.8015 10.7780 8.4799 3.3316 16.5196 17.7241 13.5081 2.5375 3.1519 13.2218 17.1203 14.6603 9.1245 50.3839
temp: 298.150 k
press: 1.00000 atm
elementType: 8 8 8 8 6 6 6 6 6 6 6 6 6 6 6 6 6 6 6 6 6 6 6 6 6 6 1 1 1 1 1 1 1 1 1 1 1 1 1 1 1 1 1 1 1 1
symmnumber: 1
zpe: 950334.0 jmol-1
zpe.correction: 0.361963 hartree
zpe.thermalcorrener: 0.385504 hartree
zpe.thermalcorrenthalpy: 0.386448 hartree
zpe.thermalcorrgfe: 0.306738 hartree
zpe.sumelectzpe: -1149.377381 hartree
zpe.sumelectthermal: -1149.353840 hartree
zpe.sumelectthermalent: -1149.352896 hartree
zpe.sumelectthermalfe: -1149.432606 hartree
dipole: 1.9943 1.2833 -0.1310
dipole: 2.3751
quadrupole: -133.6727 -140.2695 -141.9439
quadrupole: -14.2651 6.8559 -1.8062
quadrupole: 4.9560 -1.6408 -3.3152 -14.2651 6.8559 -1.8062
hfenergy: -1149.7393441 hartree
pointgroup: C01 [X(C22H20O4)]
dipole: -0.6643888 0.601509 0.2645035 debye
polarizability: 278.2712542|-26.3692127|258.470706|26.5844038|17.983347|225.5858597 unknown
InChI: InChI=1S/C22H20O4/c1-25-17-9-5-7-15(13-17)21(16-8-6-10-18(14-16)26-2)19-11-3-4-12-20(19)22(23)24/h3-14,21,23H,1-2H3
charge 0 multiplicity 1
46 atoms
O  4.240804 -2.889953 -0.224541
O  -4.829612 1.097334 -0.043228
O  1.224009 2.071679 3.671357
O  1.256819 -0.089435 2.868672
C  -0.120476 -0.424082 0.239102
C  0.259011 1.06914 0.202758
C  0.888612 -1.212057 -0.624298
C  -1.599505 -0.695932 -0.102815
C  0.795246 1.78709 1.320621
C  0.065284 1.786316 -1.006675
C  2.064036 -1.697681 0.004196
C  -2.586459 0.305444 0.018856
C  0.709161 -1.411205 -2.014133
C  -2.012477 -2.021053 -0.421019
C  1.095664 3.176434 1.199717
C  3.048515 -2.371433 -0.756997
C  -3.955664 0.004845 -0.190701
C  0.38181 3.152847 -1.12511
C  1.699955 -2.0868 -2.76489
C  -3.374018 -2.313964 -0.623793
C  0.897659 3.85809 -0.012225
C  2.871681 -2.566597 -2.149497
C  -4.364857 -1.309395 -0.516232
C  1.09446 1.136874 2.627431
C  4.471036 -2.71286 1.211808
C  -6.258906 0.846555 -0.233139
H  0.020247 -0.779269 1.274534
H  -0.346891 1.254636 -1.869955
H  2.185704 -1.534169 1.079437
H  -2.327134 1.336245 0.278021
H  -0.207539 -1.067169 -2.504734
H  -1.264623 -2.815489 -0.508442
H  1.491855 3.701618 2.072284
H  0.22323 3.667295 -2.079371
H  1.555872 -2.242835 -3.840013
H  -3.676437 -3.338545 -0.86872
H  1.142802 4.92228 -0.091464
H  3.648087 -3.092024 -2.713765
H  -5.417202 -1.558877 -0.680415
H  1.447604 1.575345 4.504413
H  3.685671 -3.212851 1.811127
H  4.511774 -1.640528 1.48483
H  5.445528 -3.18462 1.406585
H  -6.745843 1.819406 -0.070352
H  -6.641107 0.110602 0.501301
H  -6.473588 0.489143 -1.259529
