program: Gaussian 09
title: 000228375
version: EM64L-G09RevD.01
frameworkgroup: C1[X(C14H31N3O)]
method: RPBEPBE
basis: SDD
operation: Freq
keyword: #p
keyword: freq=noraman
keyword: PBEPBE/SDD
title: #p freq=noraman PBEPBE/SDD
converged: YES YES NO NO
title: Mulliken charges:
elementType: O N N N C C C C C C C C C C C C C C H H H H H H H H H H H H H H H H H H H H H H H H H H H H H H H
charge: -0.295206 -0.087173 -0.080450 -0.080806 -0.414108 -0.386032 -0.355192 -0.366198 -0.384114 -0.308883 -0.386990 -0.308676 0.228646 -0.683919 -0.698928 -0.685879 -0.701140 -0.796277 0.222256 0.241026 0.201354 0.260772 0.201266 0.214044 0.181366 0.258084 0.214005 0.221974 0.201733 0.188419 0.227277 0.216549 0.197002 0.183559 0.224293 0.220298 0.218100 0.228766 0.216590 0.212974 0.224849 0.215955 0.216334 0.229067 0.217005 0.208814 0.236204 0.264453 0.226939
chargesum: 0.00000
title: Mulliken charges with hydrogens summed into heavy atoms:
elementType: O N N N C C C C C C C C C C C C C C
charge: -0.295206 -0.087173 -0.080450 -0.080806 0.049173 0.076094 0.060118 0.073252 0.051865 0.081269 0.056836 0.071884 0.228646 -0.021229 -0.040598 -0.028741 -0.046254 -0.068681
polarizability: 2.05982136e+02 3.13346161e+00 1.91336974e+02 -2.26398275e+00 -7.60189362e-01 1.44384313e+02
1716.lowfreq: -10.5533 -3.7188 0.0001 0.0005 0.0008 4.0915 14.8404 17.4083 27.2201
frequency: 12.6142 17.0265 26.9685 46.0418 52.5331 57.1254 60.1978 64.5775 93.5159 95.9127 109.8371 112.4350 148.8092 157.6004 169.7368 204.2956 218.9611 230.9888 243.5196 258.1258 270.0066 276.7459 289.9501 291.6750 319.9959 377.3154 381.3148 404.5506 416.2329 457.1078 483.0596 486.2262 494.7711 526.3562 573.4679 623.8570 722.0809 746.3295 770.0843 770.5855 771.3401 776.6846 782.4190 804.0372 807.8258 895.5597 897.9471 956.2941 973.5564 974.2835 1006.5364 1018.0461 1021.6192 1028.5245 1044.4997 1055.2925 1056.7411 1069.2640 1072.4398 1079.4041 1082.2490 1093.4108 1111.6015 1118.1271 1139.3379 1188.6865 1203.2215 1205.3913 1222.1282 1244.8636 1263.2958 1277.3488 1282.1261 1289.0931 1297.3069 1312.9029 1317.2436 1333.8407 1334.8358 1339.4330 1341.5736 1365.9168 1367.6093 1370.8104 1372.4700 1375.4868 1380.2702 1381.3324 1386.5441 1387.2822 1411.3957 1439.7460 1451.3703 1456.9372 1457.7398 1467.1581 1467.4082 1469.6746 1473.1429 1473.9253 1476.8874 1478.1000 1480.8804 1481.8487 1483.6989 1486.3752 1489.1657 1496.8959 1499.5676 1589.9343 2843.1058 2861.2403 2873.5569 2890.7503 2976.6022 2979.1447 2984.2616 2985.1075 2988.6412 2990.4831 2993.5403 3001.3153 3002.0198 3008.5361 3013.7487 3028.4322 3040.2147 3040.4392 3053.8900 3071.8633 3073.9074 3075.6335 3076.7089 3079.1396 3080.0121 3082.7968 3084.8803 3089.3431 3090.7226 3093.0198 3127.4525
redmass: 3.3242 3.4741 3.4696 2.7370 3.4361 2.7943 2.7307 2.6658 2.9465 3.5088 2.8615 2.6929 1.0620 1.5609 1.4810 2.5357 1.3272 1.2933 1.6062 1.9618 2.2867 2.2866 1.7445 1.6397 3.0766 3.0154 2.1518 2.4428 2.7270 2.7178 2.6925 2.8412 2.7163 2.9756 3.1701 3.7756 3.2096 2.1410 1.2740 1.4274 1.2531 1.4489 1.4547 1.2052 1.2377 1.9879 1.9907 2.3988 2.4461 2.4909 1.8889 2.8039 2.9058 1.7948 1.9657 2.3193 2.3212 2.3315 2.3998 1.9070 2.1217 2.0055 1.6746 1.6646 1.7363 2.2622 2.0834 2.0835 3.0641 1.7069 1.3238 1.1649 1.3370 1.1840 1.2696 1.3227 1.2968 1.3324 1.3384 1.2285 1.2234 1.3864 1.3737 1.3034 1.3035 1.2150 1.2406 1.2362 1.2482 1.2471 2.3405 1.1387 1.0670 1.0628 1.0731 1.0523 1.0550 1.0958 1.0519 1.0503 1.0569 1.0599 1.0838 1.0498 1.0904 1.0792 1.0715 1.0756 1.0772 5.7422 1.0720 1.0711 1.0710 1.0697 1.0350 1.0353 1.0363 1.0379 1.0383 1.0596 1.0612 1.0779 1.0740 1.0857 1.0634 1.0884 1.1002 1.1015 1.0881 1.0988 1.0992 1.0976 1.0995 1.0990 1.1005 1.1004 1.0989 1.1005 1.1005 1.1031 1.0983
irintensity: 0.1978 0.0132 0.2724 0.7710 1.1110 0.5616 0.7091 0.5809 1.2319 4.4590 1.1746 0.3612 0.3071 0.6241 2.9380 0.0999 0.2629 0.1975 2.1201 1.4150 1.4566 0.6147 0.5651 1.9159 8.9763 8.7377 3.8002 2.6986 1.0718 5.7007 2.4546 16.9453 9.4402 8.9955 11.3663 8.5303 1.0213 6.3210 3.3443 1.1693 3.8795 17.0544 10.9494 4.0674 4.4632 4.3749 2.2335 3.3009 0.4484 17.1570 19.8574 13.9594 3.8350 2.2771 2.6443 4.2812 2.5056 37.9790 36.9082 16.2975 32.0765 4.9878 45.3201 2.8393 74.1902 68.9410 32.3345 18.2062 8.0119 5.9506 6.2376 1.5782 7.8888 44.3090 30.0477 20.8311 0.4870 2.3929 1.8299 13.3606 9.0582 5.5783 4.2675 9.0344 9.7104 28.1809 20.4788 18.5696 23.1719 23.5145 143.2910 23.9153 27.9512 2.5162 26.8676 13.6176 13.3748 10.2974 7.5993 4.8841 7.3950 4.8957 7.5435 4.7201 7.1410 16.3407 18.8451 2.7696 1.0659 277.5290 79.1074 74.5109 87.6299 82.4381 28.4421 26.3872 26.8002 25.9602 10.2691 50.6432 51.7397 22.6931 23.0506 31.0577 26.0913 23.3296 20.8409 9.2521 9.1337 48.2896 42.4187 17.1465 65.7983 72.3232 43.4943 37.4679 34.1216 41.6552 42.5889 15.7341 12.0764
temp: 298.150 k
press: 1.00000 atm
elementType: 8 7 7 7 6 6 6 6 6 6 6 6 6 6 6 6 6 6 1 1 1 1 1 1 1 1 1 1 1 1 1 1 1 1 1 1 1 1 1 1 1 1 1 1 1 1 1 1 1
symmnumber: 1
zpe: 1152320.5 jmol-1
zpe.correction: 0.438896 hartree
zpe.thermalcorrener: 0.462662 hartree
zpe.thermalcorrenthalpy: 0.463606 hartree
zpe.thermalcorrgfe: 0.382018 hartree
zpe.sumelectzpe: -790.027117 hartree
zpe.sumelectthermal: -790.003351 hartree
zpe.sumelectthermalent: -790.002406 hartree
zpe.sumelectthermalfe: -790.083995 hartree
dipole: -2.7884 -3.2347 1.4730
dipole: 4.5176
quadrupole: -106.4053 -122.0369 -118.1369
quadrupole: -8.4472 4.7951 5.1173
quadrupole: 9.1210 -6.5105 -2.6105 -8.4472 4.7951 5.1173
hfenergy: -790.4660124 hartree
pointgroup: C01 [X(C14H31N3O1)]
dipole: -1.1020836 -1.3193648 0.4512878 debye
polarizability: 205.8824535|3.4201577|191.4324843|1.6688213|1.6388683|144.3884857 unknown
InChI: InChI=1S/C14H31N3O/c1-6-15(7-2)10-12-17(14(5)18)13-11-16(8-3)9-4/h6-13H2,1-5H3
charge 0 multiplicity 1
49 atoms
O  1.11497 3.245633 -0.356155
N  -0.026266 1.270567 0.080313
N  -3.302804 -0.688569 0.143933
N  3.270875 -0.628904 -0.174192
C  -1.166962 0.515128 0.63613
C  1.071738 0.498279 -0.548998
C  -2.25634 0.192692 -0.423531
C  2.264018 0.278327 0.419462
C  -4.688888 -0.334049 -0.255937
C  -2.959338 -2.129924 0.04395
C  4.677958 -0.205235 0.02519
C  2.982687 -2.061177 0.074309
C  0.091829 2.656884 0.122683
C  -5.059538 -0.57754 -1.744778
C  -3.809706 -3.026502 0.962745
C  5.223597 -0.290239 1.477994
C  3.765856 -3.014423 -0.847983
C  -1.041123 3.448926 0.778918
H  -0.783438 -0.430917 1.063431
H  -1.633832 1.067443 1.467734
H  0.666839 -0.474646 -0.883322
H  1.440307 1.044736 -1.432434
H  -1.767298 -0.247174 -1.325858
H  -2.719123 1.141705 -0.753379
H  1.877716 -0.097177 1.399096
H  2.72174 1.265054 0.609401
H  -4.835862 0.736182 -0.014563
H  -5.390178 -0.892318 0.391499
H  -1.897163 -2.235343 0.337913
H  -3.027389 -2.504003 -1.008986
H  4.756773 0.839386 -0.330184
H  5.321888 -0.806864 -0.643088
H  1.90031 -2.212714 -0.105561
H  3.160497 -2.349901 1.142311
H  -4.389326 -0.0176 -2.422877
H  -4.998698 -1.648319 -2.011126
H  -6.095271 -0.242049 -1.939074
H  -3.761559 -2.66085 2.0037
H  -4.870112 -3.051309 0.653883
H  -3.432879 -4.065417 0.935679
H  4.615035 0.322267 2.168684
H  5.230169 -1.329452 1.855318
H  6.262394 0.087813 1.516927
H  3.60614 -2.738149 -1.905298
H  4.85159 -2.989236 -0.64531
H  3.425102 -4.055692 -0.698617
H  -1.027882 3.3252 1.878176
H  -0.875199 4.511868 0.549187
H  -2.040958 3.152805 0.415584
