program: Gaussian 09
title: 000228373
version: EM64L-G09RevD.01
frameworkgroup: C1[X(C14H17Cl2NO2)]
method: RPBEPBE
basis: SDD
operation: Freq
keyword: #p
keyword: freq=noraman
keyword: PBEPBE/SDD
title: #p freq=noraman PBEPBE/SDD
converged: YES YES NO NO
title: Mulliken charges:
elementType: Cl Cl O O N C C C C C C C C C C C C C C H H H H H H H H H H H H H H H H H
charge: 0.012461 -0.029978 -0.294288 -0.222572 -0.084894 -0.369077 -0.372275 -0.389608 -0.384678 -0.399761 -0.344437 -0.308445 0.198257 0.329345 -0.267320 -0.306757 -0.205263 -0.216400 -0.086234 0.179409 0.222069 0.210799 0.171129 0.194942 0.204247 0.203127 0.192853 0.215109 0.190016 0.225173 0.215848 0.237989 0.239250 0.288943 0.286660 0.264360
chargesum: 0.00000
title: Mulliken charges with hydrogens summed into heavy atoms:
elementType: Cl Cl O O N C C C C C C C C C C C C C C
charge: 0.012461 -0.029978 -0.294288 -0.222572 -0.084894 0.032401 0.009653 0.009581 0.011302 0.005365 0.096584 0.168794 0.198257 0.329345 -0.267320 -0.017814 0.081396 0.047960 -0.086234
polarizability: 2.75742610e+02 -1.46415261e+01 1.83854536e+02 -1.29256546e+01 -5.62097889e+00 1.09616618e+02
1716.lowfreq: -4.6471 -2.3773 0.0022 0.0025 0.0028 6.7373 9.6892 20.9914 25.2652
frequency: 8.7711 20.7685 23.6580 41.1287 72.0944 82.7584 92.7728 138.4186 161.8217 184.8564 206.2500 223.8337 242.5185 272.8186 288.7877 309.3998 324.2902 360.0799 371.9353 380.2527 395.5672 441.5754 447.4346 453.5408 515.5742 519.3093 542.5383 578.9790 655.0977 659.4122 720.0487 746.4441 757.2219 776.3094 802.9661 814.0160 838.4762 852.7295 856.5152 870.1715 900.4144 912.7728 958.5788 979.2883 994.0548 1005.7997 1044.0867 1049.1839 1059.5824 1070.6280 1091.2215 1101.3752 1113.7901 1129.6316 1146.2512 1149.4132 1160.0205 1196.3795 1222.2635 1254.2180 1256.9037 1263.4124 1267.0007 1291.9221 1296.1460 1319.5064 1331.7617 1341.2641 1346.9108 1354.6855 1356.7771 1371.1288 1378.1164 1392.0593 1448.1857 1452.4062 1453.9752 1460.7200 1465.5893 1468.9705 1476.6980 1482.4894 1558.0445 1586.7405 1629.3304 2829.5553 2840.7518 2905.7283 2967.5418 2985.2667 2987.0838 3024.0253 3033.1091 3037.7094 3039.6803 3044.5786 3046.7176 3055.8089 3128.8518 3173.1250 3183.9535 3193.8424
redmass: 6.5689 5.7053 4.3973 4.6833 5.4053 4.7773 6.1496 3.4854 6.0368 9.7203 4.3583 3.5774 2.0869 4.1681 4.8799 6.1440 2.8406 2.9298 3.6465 11.4574 2.1961 3.2290 2.9911 3.3956 3.6358 5.8643 5.8634 2.3920 7.3175 4.5837 4.0456 4.4423 3.7204 2.7089 1.6640 1.7060 1.4710 2.3483 1.5403 1.4094 2.8313 4.6107 1.3086 1.3542 2.5107 6.9789 2.1794 1.9431 2.6549 2.9952 4.1841 1.7771 2.1059 1.8413 1.3400 1.3246 2.3829 1.3710 3.5330 1.3632 1.3359 1.3280 1.2432 1.2885 1.2484 1.3340 1.3054 1.4290 1.4661 1.4439 3.3272 1.3950 6.5128 1.4008 1.1658 1.0918 2.2333 1.0885 1.0822 1.0902 1.0864 1.0956 8.9375 7.1273 10.7865 1.0712 1.0703 1.0690 1.0628 1.0614 1.0613 1.0883 1.0930 1.0830 1.0887 1.0703 1.1026 1.1036 1.1078 1.0897 1.0934 1.0963
irintensity: 0.1419 0.0694 0.1472 1.0777 0.9671 0.2182 0.8110 0.0601 0.0362 0.9630 1.8737 3.8404 0.7925 0.2840 7.1214 2.3288 5.0228 4.6494 17.3062 6.3470 7.4758 5.7940 2.0001 3.1106 3.0608 20.7420 0.4317 0.2232 1.2151 24.8430 10.2783 11.9497 4.7831 47.9072 5.5432 8.3907 30.6019 3.4516 12.4011 19.4245 4.4305 13.0755 2.8042 1.4996 15.4988 328.7556 15.6877 20.5913 101.6560 78.3032 11.5729 40.6472 9.1246 0.3546 33.1163 5.0955 38.3060 11.9929 269.8764 19.5805 4.0103 3.7707 16.7319 3.6250 6.8121 5.6821 1.6531 0.6540 6.0898 3.9704 17.8653 12.8380 13.6151 2.2313 31.9530 6.1857 39.9260 12.9104 4.1624 13.2106 3.4012 12.7494 41.5517 147.8216 189.0918 58.4175 120.8732 74.0864 38.4603 34.9083 32.7942 45.8494 85.1578 16.9127 12.0701 45.8351 13.5839 98.9280 12.6443 0.3467 0.7969 1.6417
temp: 298.150 k
press: 1.00000 atm
elementType: 17 17 8 8 7 6 6 6 6 6 6 6 6 6 6 6 6 6 6 1 1 1 1 1 1 1 1 1 1 1 1 1 1 1 1 1
symmnumber: 1
zpe: 748372.8 jmol-1
zpe.correction: 0.285040 hartree
zpe.thermalcorrener: 0.303628 hartree
zpe.thermalcorrenthalpy: 0.304572 hartree
zpe.thermalcorrgfe: 0.233901 hartree
zpe.sumelectzpe: -1667.564209 hartree
zpe.sumelectthermal: -1667.545622 hartree
zpe.sumelectthermalent: -1667.544678 hartree
zpe.sumelectthermalfe: -1667.615349 hartree
dipole: -1.4922 -2.4576 -0.4665
dipole: 2.9127
quadrupole: -120.5319 -125.4245 -126.8833
quadrupole: -0.5621 2.5776 -1.4635
quadrupole: 3.7480 -1.1446 -2.6034 -0.5621 2.5776 -1.4635
hfenergy: -1667.8492493 hartree
pointgroup: C01 [X(C14H17Cl2N1O2)]
dipole: 0.590476 0.9624386 0.195593 debye
polarizability: 275.2941355|-19.4517224|170.0471251|8.8498992|29.3061562|123.8725034 unknown
InChI: InChI=1S/C14H17Cl2NO2/c15-11-4-5-12(13(16)10-11)14(18)19-9-8-17-6-2-1-3-7-17/h4-5,10H,1-3,6-9H2
charge 0 multiplicity 1
36 atoms
Cl -2.765455 -2.463629 -1.488911
Cl -6.741182 1.102643 -0.23117
O  -0.126579 0.518151 0.90488
O  -0.273482 -1.558761 -0.142348
N  3.561963 0.450423 0.060656
C  3.897565 -0.927334 -0.389313
C  4.487433 1.456649 -0.519891
C  5.335935 -1.304687 0.01559
C  5.947054 1.151802 -0.1216
C  6.345225 -0.279328 -0.549781
C  2.130647 0.776531 -0.122427
C  1.33448 0.284835 1.102703
C  -0.82662 -0.502676 0.241334
C  -2.272852 -0.142242 0.094732
C  -3.21071 -0.93119 -0.628256
C  -2.758284 1.048131 0.71064
C  -4.567981 -0.557393 -0.731166
C  -4.105327 1.441446 0.625565
C  -4.994417 0.62391 -0.099993
H  3.794879 -1.013241 -1.503404
H  3.175147 -1.635855 0.054183
H  4.193939 2.456356 -0.148567
H  4.413844 1.479441 -1.639776
H  5.565339 -2.322948 -0.352861
H  5.403648 -1.323174 1.120512
H  6.041589 1.248641 0.977398
H  6.617982 1.900604 -0.585168
H  7.371042 -0.514091 -0.208324
H  6.350181 -0.342994 -1.657997
H  1.703181 0.322506 -1.047247
H  2.01408 1.872239 -0.208843
H  1.590761 0.86658 2.000466
H  1.50248 -0.790915 1.279589
H  -2.043407 1.660326 1.264387
H  -5.268393 -1.179219 -1.293442
H  -4.455308 2.357067 1.108754
