program: Gaussian 09
title: 000228368
version: EM64L-G09RevD.01
frameworkgroup: C1[X(C12H24INO2)]
method: RPBEPBE
basis: SDD
operation: Freq
keyword: #p
keyword: freq=noraman
keyword: PBEPBE/SDD
title: #p freq=noraman PBEPBE/SDD
converged: NO YES NO NO
title: Mulliken charges:
elementType: I O O N C C C C C C C C C C C C H H H H H H H H H H H H H H H H H H H H H H H H
charge: 0.007873 -0.306313 -0.295635 -0.379468 -0.383929 -0.382876 -0.379841 -0.378379 -0.378764 -0.372637 -0.394305 -0.297108 -0.272778 -0.789448 0.312589 -0.607726 0.195812 0.195744 0.194714 0.194787 0.195604 0.195488 0.197803 0.197844 0.195593 0.195652 0.198010 0.197932 0.210571 0.210531 0.226551 0.226578 0.223527 0.223365 0.286798 0.286811 0.324261 0.271190 0.226797 0.226780
chargesum: 0.00000
title: Mulliken charges with hydrogens summed into heavy atoms:
elementType: I O O N C C C C C C C C C C C C
charge: 0.007873 -0.306313 -0.295635 -0.055208 0.007627 0.006626 0.011251 0.017268 0.012482 0.023304 0.026798 0.156021 0.174114 -0.215838 0.312589 0.117042
polarizability: 2.61779137e+02 -1.85019778e+01 1.39552668e+02 -1.08033380e-02 3.03376072e-02 1.11681136e+02
1716.lowfreq: -0.0011 0.0007 0.0009 1.4586 4.1183 11.5955 17.8485 20.1411 28.7540
frequency: 13.2991 17.8438 24.8514 43.5739 52.2656 55.9656 76.5593 89.6550 93.0477 105.0513 112.3275 118.2028 129.2637 139.3802 157.3722 157.9965 172.3338 182.0938 218.1441 261.1996 301.2041 355.6696 376.2074 460.1396 470.9313 529.0899 571.8941 584.7123 670.8758 699.8340 725.0550 730.5256 736.6204 751.2681 780.3310 826.8432 871.3864 886.2548 949.0842 949.5848 983.5994 991.1257 1006.7447 1029.0883 1035.9353 1047.9820 1064.5310 1073.2049 1079.1104 1080.9156 1106.2044 1109.1511 1126.0853 1144.4924 1153.8463 1190.0037 1193.1794 1203.4839 1215.4734 1220.9866 1249.0855 1249.4664 1270.1828 1279.4125 1280.3349 1286.8702 1291.5949 1300.0748 1301.6638 1309.4901 1332.8766 1347.3632 1356.6861 1359.4845 1374.6928 1428.9795 1446.8370 1461.9561 1462.3403 1462.4943 1466.2506 1467.7405 1470.7906 1476.8700 1483.1091 1484.8946 1488.2171 1492.2810 1518.4500 1672.7743 2952.6063 2953.5213 2956.9593 2958.9725 2964.1758 2969.0465 2976.1982 2987.0692 2987.6313 2993.4658 2995.8252 2998.6164 3001.5838 3012.6832 3027.5001 3039.1149 3045.5316 3049.0745 3052.2861 3059.0298 3072.3086 3109.8822 3133.5632 3579.2953
redmass: 4.7447 5.5095 4.6128 2.5308 4.9199 2.8760 2.0290 8.3687 2.1216 1.2528 1.8627 4.9119 1.9154 2.4896 1.9704 2.2554 4.5381 3.7968 4.7447 3.8786 4.5341 3.9895 3.8024 3.5147 3.3863 4.1242 1.1090 4.3535 5.7012 11.6293 1.0624 1.0714 1.0881 1.1222 1.1647 1.2222 4.6727 1.2449 6.7993 1.2220 5.2431 5.4063 1.1456 4.0425 4.1388 1.0357 2.8159 3.1212 2.4706 2.2020 4.8761 3.8002 1.2791 1.7185 1.4288 1.1760 1.6565 2.2166 1.2529 1.4343 1.2815 1.3098 1.1776 1.0755 1.2895 1.0900 1.0843 1.1117 1.1046 1.3163 1.3726 1.4679 1.5893 1.6262 1.5077 1.1646 1.1034 1.2434 1.0891 1.1086 1.0658 1.0753 1.0905 1.0963 1.0956 1.0444 1.0974 1.0927 1.4417 8.8573 1.0588 1.0588 1.0592 1.0590 1.0592 1.0585 1.0355 1.0967 1.0596 1.0985 1.0595 1.0566 1.1008 1.1033 1.1045 1.1046 1.1050 1.0561 1.1026 1.1044 1.1080 1.0979 1.1104 1.0772
irintensity: 0.0596 0.1532 0.2479 0.8663 1.4688 0.8515 2.8319 0.1525 0.0158 0.5078 2.9690 0.3434 0.5594 4.3077 0.1115 0.9300 4.5292 0.2785 4.1758 0.1322 10.6419 7.7083 7.6131 0.2437 6.6555 1.9055 139.6037 31.1806 12.0176 23.3712 13.1746 1.1847 13.9660 0.0014 1.5486 0.4436 16.6003 0.4404 50.5858 1.0340 0.6554 27.7342 0.4665 1.4104 0.6719 1.4102 0.7717 14.5310 7.2086 8.1853 187.6379 109.3657 0.0205 14.6655 0.6495 11.2450 0.3856 293.2934 62.1327 0.2288 5.2545 0.1350 1.4693 0.0233 20.3958 0.0248 0.1566 0.1256 0.0849 5.8461 3.1201 0.1998 2.4946 0.5798 18.9136 30.2479 3.2591 106.2248 14.8901 28.1152 0.3147 0.4654 2.2076 1.3836 0.5799 14.7836 12.9853 22.9749 159.8361 273.0357 0.3053 0.1046 0.7214 1.7235 7.4882 163.8813 87.1267 0.0149 20.1069 0.7195 27.7642 52.5079 0.0153 2.7521 0.7843 36.3902 89.3352 20.3865 39.1937 78.6812 97.7252 3.9115 14.3683 32.7118
temp: 298.150 k
press: 1.00000 atm
elementType: 53 8 8 7 6 6 6 6 6 6 6 6 6 6 6 6 1 1 1 1 1 1 1 1 1 1 1 1 1 1 1 1 1 1 1 1 1 1 1 1
symmnumber: 1
zpe: 910670.9 jmol-1
zpe.correction: 0.346856 hartree
zpe.thermalcorrener: 0.368029 hartree
zpe.thermalcorrenthalpy: 0.368973 hartree
zpe.thermalcorrgfe: 0.290440 hartree
zpe.sumelectzpe: -687.082135 hartree
zpe.sumelectthermal: -687.060962 hartree
zpe.sumelectthermalent: -687.060018 hartree
zpe.sumelectthermalfe: -687.138551 hartree
dipole: 2.5390 -3.3563 -0.0103
dipole: 4.2085
quadrupole: -131.4114 -117.4584 -113.8252
quadrupole: -21.0177 -0.2101 0.0032
quadrupole: -10.5130 3.4399 7.0732 -21.0177 -0.2101 0.0032
hfenergy: -687.4289911 hartree
pointgroup: C01 [X(C12H24I1N1O2)]
dipole: -0.9616595 -1.3476639 0.0224564 debye
polarizability: 260.651012|21.8823163|140.6745475|-0.3186907|-0.4266844|111.6873815 unknown
InChI: InChI=1S/C12H24INO2/c1-14-12(15)16-11-9-7-5-3-2-4-6-8-10-13/h14H,2-11H2,1H3
charge 0 multiplicity 1
40 atoms
I  9.870524 0.571768 -0.007214
O  -4.71343 -0.464441 0.005684
O  -6.128538 1.427982 -0.025486
N  -6.964873 -0.773491 0.017753
C  1.58717 0.367206 -0.011276
C  2.862348 -0.505658 -0.002245
C  0.283458 -0.462051 -0.002416
C  4.166655 0.322884 -0.009555
C  -0.992358 0.409726 -0.012309
C  5.440063 -0.55469 -0.00032
C  -2.289563 -0.43185 0.000167
C  6.739445 0.292988 -0.007619
C  -3.539555 0.449208 -0.011718
C  7.980341 -0.604418 0.003019
C  -5.969676 0.179363 -0.003093
C  -8.38451 -0.414385 0.015038
H  1.598332 1.023864 -0.906243
H  1.598458 1.042287 0.869875
H  2.849939 -1.162814 0.892442
H  2.8508 -1.179947 -0.884082
H  0.272144 -1.137532 -0.883143
H  0.271852 -1.117839 0.89309
H  4.179078 0.996308 0.872352
H  4.180076 0.979221 -0.90424
H  -0.979173 1.086508 0.867292
H  -0.981036 1.063732 -0.909004
H  5.428262 -1.226731 -0.883282
H  5.42709 -1.209625 0.89541
H  -2.311004 -1.103467 -0.879974
H  -2.310019 -1.077985 0.899222
H  6.751356 0.961158 0.874455
H  6.753325 0.942888 -0.903214
H  -3.592687 1.08197 -0.917439
H  -3.58904 1.111163 0.873106
H  8.051313 -1.221917 0.912141
H  8.053276 -1.240688 -0.892902
H  -6.675387 -1.751296 0.035501
H  -8.453254 0.685001 -0.006215
H  -8.896306 -0.783248 0.923522
H  -8.901697 -0.818351 -0.875279
