program: Gaussian 09
title: 000228358
version: EM64L-G09RevD.01
frameworkgroup: C1[X(C11H15NO2S)]
method: RPBEPBE
basis: SDD
operation: Freq
keyword: #p
keyword: freq=noraman
keyword: PBEPBE/SDD
title: #p freq=noraman PBEPBE/SDD
converged: NO YES NO NO
title: Mulliken charges:
elementType: S O O N C C C C C C C C C C C H H H H H H H H H H H H H H H
charge: 0.244682 -0.419831 -0.219950 -0.052050 0.228315 -0.462136 -0.498153 -0.390699 -0.385699 -0.143167 0.147923 -0.618706 -0.282740 -0.147490 -0.511414 0.222907 0.225628 0.234803 0.230634 0.208621 0.203814 0.199629 0.211573 0.222395 0.224119 0.188192 0.252065 0.243151 0.263259 0.380326
chargesum: 0.00000
title: Mulliken charges with hydrogens summed into heavy atoms:
elementType: S O O N C C C C C C C C C C C
charge: 0.244682 -0.039506 -0.219950 -0.052050 0.228315 -0.013602 -0.032716 0.021736 0.025503 -0.143167 0.147923 0.016001 -0.030675 0.095661 -0.248154
polarizability: 1.42935867e+02 1.55967816e+01 1.36277422e+02 -2.05841123e+00 -1.81091597e+00 1.39058263e+02
1716.lowfreq: -8.1067 -7.1851 0.0014 0.0019 0.0026 11.3573 30.5573 41.2364 61.6833
frequency: 30.4792 41.2170 61.5604 97.9309 140.8955 159.9702 181.4234 232.2972 237.7800 247.0935 299.8332 319.3573 343.5726 353.2431 373.8232 457.1798 473.6045 484.4334 500.1808 543.0658 563.9722 601.4224 622.4426 634.8840 688.1270 696.7245 710.0702 742.8059 803.4666 814.8090 831.3639 843.4337 906.7289 925.1701 934.8255 995.1248 1006.0038 1026.1132 1041.6289 1061.5797 1068.8181 1084.4624 1092.0690 1110.5143 1135.3640 1139.9346 1163.8013 1187.5815 1205.9451 1230.8275 1278.4626 1283.4586 1287.6337 1293.3029 1323.9646 1337.5110 1348.0019 1352.8549 1376.7874 1430.6608 1454.5275 1461.1887 1463.3702 1468.2943 1475.6635 1480.4180 1481.7599 1543.2469 1646.4414 2848.7016 2849.5453 2865.1516 3009.5176 3011.9909 3016.9126 3025.4687 3031.5376 3074.1530 3075.0829 3083.9425 3170.3589 3188.0325 3236.3646 3513.4489
redmass: 6.4004 12.0859 4.1278 5.0775 2.5482 5.1926 3.7104 1.1774 4.7649 2.8970 4.9632 2.6974 2.0593 3.9318 1.9524 3.9552 4.9842 3.1593 4.4846 2.6090 2.5204 1.4762 4.5240 3.9047 5.9911 1.2016 4.9227 3.2549 4.0867 1.5458 1.3229 3.5545 1.4089 2.5864 2.7299 2.6190 2.2089 1.7767 2.3579 1.7776 1.7569 1.4820 1.6235 1.3903 2.9465 2.5099 2.4606 1.1027 1.9562 1.5583 1.8073 1.7861 1.8839 1.5034 1.4097 2.0983 1.3906 1.3349 1.4054 1.1803 1.0850 1.0710 1.0575 1.4727 2.4284 1.1360 1.0656 5.5355 9.4753 1.0624 1.0713 1.0639 1.0674 1.0662 1.0727 1.0813 1.0846 1.1023 1.1010 1.0999 1.0894 1.0974 1.1003 1.0640
irintensity: 0.1428 0.8052 0.1570 0.9541 0.1616 0.3927 2.7101 0.1172 2.5593 0.6652 3.8031 7.5732 0.3232 0.7151 2.8100 5.4639 2.6665 0.8719 12.6972 18.7097 3.3686 110.3042 8.6917 35.2953 5.5047 103.4660 28.2701 1.7348 11.0793 1.4891 9.8159 0.7772 0.7313 23.2156 7.8896 97.3730 12.3612 2.7850 91.4783 28.2786 7.2328 42.9908 15.6289 6.9578 12.9103 17.1506 16.4707 3.8266 5.2997 26.3313 17.2566 15.1381 15.7100 11.3161 0.9000 0.5198 4.1720 2.1510 4.0380 1.6244 14.3748 6.5432 23.5373 15.4028 18.0644 6.5999 7.9700 2.5606 226.3386 52.2683 33.0585 191.2751 1.7247 21.3627 48.4582 64.2558 40.8751 20.7508 34.6297 24.6847 7.4809 3.4806 0.8616 25.6980
temp: 298.150 k
press: 1.00000 atm
elementType: 16 8 8 7 6 6 6 6 6 6 6 6 6 6 6 1 1 1 1 1 1 1 1 1 1 1 1 1 1 1
symmnumber: 1
zpe: 635436.7 jmol-1
zpe.correction: 0.242025 hartree
zpe.thermalcorrener: 0.256587 hartree
zpe.thermalcorrenthalpy: 0.257531 hartree
zpe.thermalcorrgfe: 0.199848 hartree
zpe.sumelectzpe: -1030.263453 hartree
zpe.sumelectthermal: -1030.248891 hartree
zpe.sumelectthermalent: -1030.247947 hartree
zpe.sumelectthermalfe: -1030.305629 hartree
dipole: 0.1162 -1.3721 2.2423
dipole: 2.6314
quadrupole: -92.8908 -93.6617 -95.7803
quadrupole: 0.2521 -3.3588 5.5429
quadrupole: 1.2201 0.4493 -1.6694 0.2521 -3.3588 5.5429
hfenergy: -1030.5054776 hartree
pointgroup: C01 [X(C11H15N1O2S1)]
dipole: -0.0058026 0.7090702 0.754296 debye
polarizability: 143.7573635|15.5532635|136.2311551|-1.2412467|1.8380098|138.2830327 unknown
InChI: InChI=1S/C11H15NO2S/c1-12-6-4-11(5-7-12,10(13)14)9-3-2-8-15-9/h2-3,8,13H,4-7H2,1H3
charge 0 multiplicity 1
30 atoms
S  1.7238 0.905686 -1.55322
O  1.201161 -2.259076 1.456253
O  0.977637 -2.818551 -0.780475
N  -2.798455 0.477347 -0.116106
C  -0.080179 -0.717757 0.056871
C  -1.035468 -0.580251 1.285919
C  -0.958164 -0.775585 -1.227963
C  -2.000439 0.608957 1.125948
C  -1.922739 0.421622 -1.311738
C  0.953413 0.40873 0.019666
C  0.728678 -2.029896 0.156208
C  -3.831719 1.523815 -0.228386
C  1.508685 1.130059 1.067542
C  2.52084 2.078044 0.67059
C  2.760094 2.087734 -0.693222
H  -0.459258 -0.489382 2.221466
H  -1.632892 -1.507995 1.357696
H  -1.550002 -1.708148 -1.200338
H  -0.323467 -0.822527 -2.13101
H  -2.696097 0.625462 1.986141
H  -1.424888 1.570124 1.144529
H  -1.341609 1.371167 -1.439695
H  -2.562624 0.306735 -2.206586
H  -4.500361 1.483235 0.650511
H  -4.443447 1.346472 -1.131213
H  -3.410244 2.559515 -0.294559
H  1.211522 0.980398 2.107738
H  3.049934 2.725609 1.373906
H  3.457194 2.695356 -1.267588
H  1.757295 -3.084697 1.456318
