program: Gaussian 09
title: 000228354
version: EM64L-G09RevD.01
frameworkgroup: C1[X(C9H21N3O)]
method: RPBEPBE
basis: SDD
operation: Freq
keyword: #p
keyword: freq=noraman
keyword: PBEPBE/SDD
title: #p freq=noraman PBEPBE/SDD
converged: YES YES NO NO
title: Mulliken charges:
elementType: O N N N C C C C C C C C C H H H H H H H H H H H H H H H H H H H H H
charge: -0.275468 -0.057626 -0.081900 -0.056723 -0.414346 -0.386729 -0.325892 -0.400354 -0.071532 -0.615023 -0.614171 -0.618016 -0.619780 0.221633 0.237096 0.214000 0.260868 0.222233 0.188370 0.251304 0.206678 0.163813 0.220228 0.191061 0.229160 0.224583 0.191375 0.229878 0.191896 0.219700 0.238783 0.221690 0.226044 0.187172
chargesum: 0.00000
title: Mulliken charges with hydrogens summed into heavy atoms:
elementType: O N N N C C C C C C C C C
charge: -0.275468 -0.057626 -0.081900 -0.056723 0.044383 0.088138 0.084711 0.057628 0.092281 0.025426 0.031664 0.032364 0.015124
polarizability: 1.44684019e+02 -3.25068970e+00 1.31777465e+02 -5.48600162e+00 5.26488463e-01 9.62629864e+01
1716.lowfreq: -13.7751 -6.5309 -0.0009 -0.0007 -0.0004 4.7841 18.9885 26.8170 30.2767
frequency: 18.2977 26.3373 30.2007 52.1587 69.7664 100.2165 108.3305 160.4828 172.2177 217.1761 221.5118 229.4132 237.8028 240.7590 271.2624 300.1880 330.7729 349.9652 385.9387 403.4911 417.2045 424.1715 449.6257 515.6244 668.1314 767.8059 783.0429 805.1170 827.0086 884.6544 954.3541 984.9034 1019.2571 1031.0894 1035.1766 1046.1571 1050.3303 1052.2920 1060.6133 1089.4372 1090.8111 1128.7580 1132.0701 1138.1495 1156.0768 1223.4732 1239.1938 1265.9978 1285.2979 1288.7951 1291.4642 1314.8715 1323.5858 1336.2254 1364.3485 1376.0203 1382.0926 1397.1235 1421.7333 1423.1915 1434.9888 1443.3775 1447.6809 1457.0098 1458.7619 1460.7290 1464.5874 1469.9139 1472.7494 1475.4535 1479.9407 1483.8137 1485.9061 1498.3995 1622.0084 2844.3898 2848.4975 2852.4474 2869.9303 2870.9056 2921.5180 2975.5622 3002.4356 3004.7753 3006.5544 3011.3644 3022.3255 3027.2776 3030.7710 3043.2855 3064.2387 3069.6000 3076.3821 3078.7821 3080.5526 3084.1854
redmass: 3.2027 2.9340 2.8502 4.2418 3.9150 2.2338 2.4325 2.5117 2.9792 1.3252 1.4230 1.1070 1.0866 1.6542 2.6005 3.0218 2.2979 2.6344 2.2052 2.5447 2.2202 2.7829 2.6182 4.2029 3.7367 1.3236 1.2226 4.0093 3.9501 3.7675 1.6398 4.9043 2.8121 1.5990 1.6777 1.4863 2.0652 2.0287 2.5481 1.2833 1.2775 1.4162 1.8151 1.4345 1.6743 2.9993 2.0589 2.4756 1.6379 2.1293 1.3177 1.2889 1.3310 1.4146 1.2246 1.3421 1.3435 2.1665 1.1452 1.1424 1.1045 1.1423 1.1268 1.0517 1.0803 1.0694 1.0818 1.0707 1.0825 1.0654 1.0697 1.0523 1.0555 1.0578 5.8373 1.0687 1.0574 1.0569 1.0580 1.0566 1.0854 1.0616 1.0643 1.0651 1.0620 1.0741 1.0733 1.0740 1.0856 1.0996 1.1008 1.1037 1.1036 1.1021 1.1013 1.1008
irintensity: 0.0759 0.2374 0.4005 4.2388 1.6536 2.2425 0.5390 2.6575 0.4796 1.2169 1.2153 2.4747 0.6514 0.5949 7.8644 6.0419 6.1470 16.0574 2.6573 10.8959 4.2954 17.7385 13.6623 3.7844 7.6955 8.6703 9.4163 19.4654 11.7995 2.6754 3.7270 4.9692 15.5011 20.7614 12.0215 13.9691 24.6078 40.6540 41.7855 5.6557 12.3316 16.2030 49.6252 9.2019 14.6268 6.3748 1.1439 11.5564 3.8068 11.8142 10.7924 1.4699 2.7103 2.0498 12.6442 0.5348 29.2074 54.4575 0.3275 4.1689 2.1276 0.1238 13.0965 13.8565 19.8649 11.3264 3.7326 5.4619 32.9425 8.2595 31.6228 7.8629 11.3864 11.6122 358.1121 72.4060 83.6375 77.7597 117.4618 217.7004 97.6169 30.8777 42.7030 57.3057 7.1231 63.1197 39.9497 60.6742 6.1854 8.7927 30.6614 22.6559 28.0978 30.4327 41.7692 49.5647
temp: 298.150 k
press: 1.00000 atm
elementType: 8 7 7 7 6 6 6 6 6 6 6 6 6 1 1 1 1 1 1 1 1 1 1 1 1 1 1 1 1 1 1 1 1 1
symmnumber: 1
zpe: 785424.2 jmol-1
zpe.correction: 0.299152 hartree
zpe.thermalcorrener: 0.316027 hartree
zpe.thermalcorrenthalpy: 0.316971 hartree
zpe.thermalcorrgfe: 0.252164 hartree
zpe.sumelectzpe: -593.899226 hartree
zpe.sumelectthermal: -593.882351 hartree
zpe.sumelectthermalent: -593.881407 hartree
zpe.sumelectthermalfe: -593.946214 hartree
dipole: 3.0557 -3.9538 0.5695
dipole: 5.0293
quadrupole: -80.5020 -92.0979 -83.3971
quadrupole: 6.0647 -0.7634 -2.9692
quadrupole: 4.8303 -6.7656 1.9352 6.0647 -0.7634 -2.9692
hfenergy: -594.198378 hartree
pointgroup: C01 [X(C9H21N3O1)]
dipole: 1.2224872 -1.548338 0.1529133 debye
polarizability: 144.6330564|-2.8676064|131.6171172|-6.126684|1.8184641|96.4742968 unknown
InChI: InChI=1S/C9H21N3O/c1-10(2)5-7-12(9-13)8-6-11(3)4/h9H,5-8H2,1-4H3
charge 0 multiplicity 1
34 atoms
O  -1.234188 2.974458 0.376836
N  -0.022674 1.023002 -0.116697
N  3.483145 -0.487843 -0.138996
N  -3.212067 -1.136241 -0.228482
C  1.215172 0.440071 -0.670595
C  -1.071494 0.135382 0.428357
C  2.271933 0.147462 0.424625
C  -2.118622 -0.254414 -0.668653
C  -0.216615 2.392771 -0.100599
C  3.298826 -1.919543 -0.454339
C  4.687405 -0.26156 0.687784
C  -4.163395 -0.53233 0.720324
C  -2.819351 -2.510846 0.115781
H  0.959022 -0.487137 -1.215618
H  1.656566 1.135977 -1.406584
H  -0.590122 -0.767166 0.847776
H  -1.579811 0.678736 1.244367
H  2.56302 1.110496 0.883771
H  1.807533 -0.469553 1.237262
H  -2.558393 0.682596 -1.058066
H  -1.591558 -0.747415 -1.510311
H  0.633629 2.946273 -0.563615
H  2.455207 -2.059504 -1.151941
H  3.104873 -2.545874 0.453953
H  4.206582 -2.307456 -0.94951
H  5.573599 -0.667372 0.167355
H  4.63294 -0.741926 1.697411
H  4.844384 0.821923 0.831109
H  -3.773594 -0.435093 1.763962
H  -5.081587 -1.147546 0.764126
H  -4.442831 0.476866 0.370149
H  -2.175923 -2.924659 -0.682535
H  -3.722266 -3.145895 0.184886
H  -2.270442 -2.608439 1.087005
