program: Gaussian 09
title: 000021567
version: EM64L-G09RevD.01
frameworkgroup: C1[X(C7H14N2O)]
method: RPBEPBE
basis: SDD
operation: Freq
keyword: #p
keyword: freq=noraman
keyword: PBEPBE/SDD
title: #p freq=noraman PBEPBE/SDD
converged: YES YES NO NO
title: Mulliken charges:
elementType: O N N C C C C C C C H H H H H H H H H H H H H H
charge: -0.298492 -0.093389 0.048423 0.001411 -0.437680 -0.403144 -0.406131 -0.391886 -0.392968 -0.646270 0.208785 0.225521 0.220310 0.205786 0.214194 0.208378 0.191959 0.192660 0.207727 0.202972 0.198319 0.222730 0.263813 0.256973
chargesum: 0.00000
title: Mulliken charges with hydrogens summed into heavy atoms:
elementType: O N N C C C C C C C
charge: -0.298492 -0.093389 0.048423 0.210196 0.008151 0.016836 -0.005794 0.008500 0.008323 0.097246
polarizability: 1.15248310e+02 3.71963167e+00 8.85760676e+01 4.55419052e+00 3.98907828e+00 7.35730942e+01
1716.lowfreq: -8.6113 0.0005 0.0007 0.0008 11.5614 15.9457 44.2047 64.1829 109.3211
frequency: 44.1434 63.6369 109.2879 139.4172 223.5479 229.8535 284.1661 333.2853 352.1081 376.5534 407.1615 443.1314 474.2506 498.8499 714.1156 783.2356 788.7339 826.6745 856.2357 883.7933 896.2431 920.2266 968.9397 1022.6810 1048.0607 1055.2635 1071.2456 1094.0424 1110.1341 1118.4019 1156.6009 1201.4741 1242.8396 1252.6955 1256.4105 1264.4007 1306.5445 1309.4726 1327.4045 1329.8786 1335.6538 1341.2585 1344.3115 1369.5515 1423.4804 1440.4754 1461.2103 1464.5271 1465.2171 1473.7760 1478.8410 1481.8856 2947.8747 2967.5335 2968.8947 2973.8065 2980.8854 2991.0522 3007.8271 3032.8404 3035.1894 3040.8663 3048.0232 3070.4685 3071.8991 3124.3168
redmass: 3.7822 1.1850 2.4983 3.6341 3.6551 1.7988 3.0860 2.3803 4.4831 3.3049 3.8455 3.5358 2.6959 1.6198 3.2714 2.0224 1.7259 3.9714 1.9196 1.8824 1.5841 1.8790 2.3107 2.2595 1.8182 1.1490 1.4980 1.4094 2.6468 1.9945 2.1810 1.6758 1.6939 1.4028 1.4341 1.9284 1.5959 1.8223 1.3831 1.8835 1.4714 1.4743 1.4740 1.4902 1.1852 1.0523 1.0863 1.0859 1.0906 1.0806 1.0727 1.0885 1.0829 1.0636 1.0647 1.0617 1.0605 1.0342 1.0629 1.0968 1.0951 1.1015 1.1037 1.0995 1.1023 1.1015
irintensity: 3.5489 0.1958 0.6158 3.0353 3.8887 0.3294 1.2481 0.7833 2.2350 0.6945 3.8162 1.3339 0.4126 1.1100 4.0476 2.9998 0.8088 3.8917 24.9939 3.3366 10.5942 1.8893 33.7779 59.8235 0.1630 1.7163 5.0832 10.6351 7.0064 20.4081 29.6699 13.4288 4.6097 3.0270 11.8052 3.9056 38.5706 62.6494 0.6310 14.5986 2.0380 0.9011 0.6154 8.1882 26.1059 14.4069 3.2506 8.9067 8.8393 31.8226 9.7124 3.8077 17.9793 31.4194 42.7716 32.4485 26.9806 17.5245 17.8828 68.2651 57.1466 5.6886 74.0666 3.6648 58.8652 11.0937
temp: 298.150 k
press: 1.00000 atm
elementType: 8 7 7 6 6 6 6 6 6 6 1 1 1 1 1 1 1 1 1 1 1 1 1 1
symmnumber: 1
zpe: 545059.3 jmol-1
zpe.correction: 0.207602 hartree
zpe.thermalcorrener: 0.218082 hartree
zpe.thermalcorrenthalpy: 0.219026 hartree
zpe.thermalcorrgfe: 0.171205 hartree
zpe.sumelectzpe: -458.998973 hartree
zpe.sumelectthermal: -458.988493 hartree
zpe.sumelectthermalent: -458.987549 hartree
zpe.sumelectthermalfe: -459.035370 hartree
dipole: 3.6893 2.8303 1.8426
dipole: 5.0017
quadrupole: -72.4258 -61.1705 -60.4890
quadrupole: -7.6793 -5.2786 -0.8203
quadrupole: -7.7307 3.5246 4.2061 -7.6793 -5.2786 -0.8203
hfenergy: -459.2065747 hartree
pointgroup: C01 [X(C7H14N2O1)]
dipole: 1.4938915 -0.8373362 -0.9692709 debye
dipolederiv: -1.1226079 0.3382323 0.4661414 -0.2454809 -0.2313894 0.0826988 0.1720619 -0.1205834 -0.3465518 -0.5668609 0.0946266 0.1407731 0.415056 -0.3370655 -0.1515373 0.4132332 -0.1119655 -0.4013884 0.9397088 -0.463031 -0.6228797 -0.3630654 0.1264905 0.2263326 -0.6428513 0.2886663 0.3069825 0.5888552 0.0224326 -0.0286529 0.1117324 0.1234458 -0.1113395 -0.0506393 -0.0544234 0.2902021 -0.0128955 -0.0049353 -0.0011253 -0.0287569 0.0266483 -0.0132739 0.0091349 0.0096515 0.0976287 -0.0817628 -0.0050838 0.0324165 -0.0371602 0.0654014 0.0753544 0.0338983 0.0262845 0.0824559 0.0679834 0.0269211 -0.006447 -0.0229239 0.0683479 0.0358462 -0.0354903 0.0041557 0.1650364 0.0642443 -0.0195214 0.0049444 0.0383045 0.0477201 -0.0065705 -0.0712807 0.0303597 0.1653256 0.0592549 -0.0009572 -0.0268918 0.0105466 0.0428886 0.0150417 0.0239175 0.0230651 0.1347222 0.0895759 -0.0243023 0.0202244 0.0528839 0.1442242 -0.0614334 0.031655 -0.0271661 0.1681624 -0.0275836 0.0087365 0.0314473 -0.0040875 0.0340458 -0.0377478 0.0270836 -0.0335448 -0.1636934 0.0727146 -0.0085596 0.0114484 -0.0254627 0.0635257 -0.0015091 0.0312154 -0.0443825 -0.1080302 -0.0398632 0.0981486 -0.0628849 0.0797329 -0.0437397 0.0655212 -0.0782651 0.0727099 0.0256637 0.0160979 -0.0993582 -0.0160673 -0.0961773 -0.1707755 -0.0115822 -0.0212051 -0.0475122 0.0600147 0.0295488 0.0241089 0.0267957 0.0308079 0.0651738 -0.0662478 0.023657 -0.0029083 -0.1309149 -0.003401 -0.0741966 -0.0055232 -0.0917528 -0.1880136 -0.0096279 -0.0198949 -0.0460475 0.0744831 0.0201194 0.0125028 -0.001638 0.0389632 0.073188 -0.0648996 0.0351838 0.0093376 -0.195866 0.0425206 -0.0287 0.0046364 -0.0296618 0.0404485 -0.0369734 0.0624856 -0.0912667 -0.1768194 -0.0771964 0.1000475 -0.0529075 0.1022849 -0.0783125 0.0788279 -0.0773181 0.1038386 0.0211107 -0.2300429 -0.0337369 0.0467743 -0.0290335 0.0394876 0.0125914 0.079557 0.0166615 0.0629903 0.0915024 0.0174529 0.0316427 0.0026265 0.0125167 -0.0332409 -0.0398055 -0.0430189 -0.179667 0.040678 0.0686792 0.1135978 0.0377698 0.0554937 -0.0521761 0.0963924 -0.0633583 0.0186982 -0.039738 -0.0063261 -0.1068831 0.0734491 0.0527696 0.0394458 -0.0366501 -0.0053207 0.05835 0.0791482 -0.0431806 0.0010585 -0.0205948 -0.03252 0.0264994 0.0339248 0.106768 -0.0288954 unknown
polarizability: 114.5644588|0.5767086|87.0092845|-8.5106383|5.0732275|75.8237284 unknown
InChI: InChI=1S/C7H14N2O/c1-9(8-10)7-5-3-2-4-6-7/h7H,2-6H2,1H3
charge 0 multiplicity 1
24 atoms
O  -3.230553 0.20935 1.04778
N  -1.378689 -0.397949 -0.04697
N  -1.995643 0.500621 0.794393
C  0.065515 -0.19859 -0.341372
C  0.537628 1.243714 -0.04707
C  0.939604 -1.229035 0.425545
C  2.024257 1.40119 -0.447461
C  2.430618 -1.072076 0.041641
C  2.924368 0.374567 0.281761
C  -2.116754 -1.56401 -0.570851
H  0.191253 -0.383353 -1.430891
H  0.40935 1.462837 1.028272
H  -0.096453 1.965308 -0.593815
H  0.595738 -2.259822 0.211966
H  0.807621 -1.056274 1.511988
H  2.358064 2.431062 -0.218363
H  2.131309 1.269292 -1.544485
H  2.562644 -1.332143 -1.029457
H  3.042119 -1.79018 0.620549
H  3.973871 0.479795 -0.053917
H  2.911479 0.588232 1.370136
H  -1.488439 -2.077601 -1.314399
H  -3.060604 -1.226562 -1.033999
H  -2.385304 -2.262771 0.242719
