program: Gaussian 09
title: 000228353
version: EM64L-G09RevD.01
frameworkgroup: C1[X(C9H15BrO2)]
method: RPBEPBE
basis: SDD
operation: Freq
keyword: #p
keyword: freq=noraman
keyword: PBEPBE/SDD
title: #p freq=noraman PBEPBE/SDD
converged: YES YES NO NO
title: Mulliken charges:
elementType: Br O O C C C C C C C C C H H H H H H H H H H H H H H H
charge: -0.015863 -0.321756 -0.230392 0.397075 -0.464420 -0.486888 -0.395654 -0.396012 -0.431179 -0.389305 0.058300 -0.671154 0.230778 0.197099 0.200245 0.208909 0.221521 0.198060 0.196686 0.222231 0.237724 0.205903 0.187670 0.207606 0.255087 0.294902 0.282828
chargesum: 0.00000
title: Mulliken charges with hydrogens summed into heavy atoms:
elementType: Br O O C C C C C C C C C
charge: -0.015863 -0.321756 -0.230392 0.397075 -0.036542 -0.077734 0.023927 0.022905 0.012447 0.005971 0.313386 -0.093424
polarizability: 1.56544268e+02 4.91010217e+00 9.39338013e+01 -4.12291109e+00 -9.17401278e-01 9.27661520e+01
1716.lowfreq: -0.0005 -0.0001 0.0005 6.0505 8.9451 30.0521 52.7709 66.7779 102.3323
frequency: 37.9570 61.6703 102.3259 132.4278 169.2193 186.4620 230.5798 280.4794 318.2991 356.0081 405.7316 424.1145 429.5865 468.2451 511.8945 601.3228 639.9355 695.9960 730.7125 774.9093 781.0380 809.8438 849.3430 873.5877 899.9484 908.0410 929.7530 934.8596 957.0506 985.0474 998.1291 1053.2254 1078.7587 1086.4315 1102.5890 1126.7553 1142.2608 1148.7005 1158.2600 1177.6693 1207.8979 1240.4706 1248.6273 1262.5673 1272.6259 1290.6892 1323.8959 1331.7894 1340.5341 1342.3306 1344.4251 1350.3249 1366.2596 1426.0731 1448.3750 1459.7354 1464.2380 1470.4832 1471.5160 1476.7579 2964.2518 2966.5989 2968.8581 2975.0463 2989.3296 2991.0333 3033.3553 3036.9274 3042.0449 3043.4802 3050.7616 3057.8551 3065.1365 3099.5553 3156.0737
redmass: 5.4995 5.0582 4.1164 3.1857 4.6627 3.1657 2.9451 2.0448 2.6493 2.8752 2.0905 2.5375 2.8289 3.2332 1.9847 4.2779 3.7802 5.3628 4.4804 2.9814 1.5971 2.3909 2.0582 1.9959 3.0903 2.7220 1.5547 2.3409 2.2317 2.6645 1.7140 1.9461 2.3938 1.4692 1.4261 2.1739 1.8250 1.7819 1.7451 1.2912 1.1457 1.6254 1.2851 1.2533 1.2684 1.4546 1.3795 1.5053 1.3965 1.4762 1.4596 1.3101 1.6009 1.1082 1.0880 1.0919 1.0851 1.0843 1.0880 1.0901 1.0635 1.0639 1.0650 1.0636 1.0632 1.0605 1.0966 1.0975 1.0901 1.0958 1.1037 1.1035 1.0566 1.0976 1.1109
irintensity: 0.4006 0.4200 0.6035 6.7882 0.1553 1.1804 2.8438 0.2026 1.7859 0.3324 0.6065 1.0570 15.6799 1.9078 3.9708 31.1362 24.7149 29.1989 18.2281 10.1761 6.3232 10.1443 6.1999 34.9967 85.8684 13.6387 10.6531 2.5241 6.1017 85.1640 13.1590 1.7505 90.2226 44.1713 1.4732 4.8655 4.9315 4.1322 13.5830 3.9257 24.9631 4.3021 4.5289 2.7437 3.9293 7.7794 2.1687 2.6698 0.7057 0.8894 0.9317 9.7145 3.0366 16.6473 5.8583 10.3613 10.1205 14.8981 6.6985 8.6018 41.5532 3.9366 29.9539 76.6511 15.4726 44.5383 69.3087 49.2690 12.4725 27.4590 3.5225 96.2637 12.1395 20.8032 5.3098
temp: 298.150 k
press: 1.00000 atm
elementType: 35 8 8 6 6 6 6 6 6 6 6 6 1 1 1 1 1 1 1 1 1 1 1 1 1 1 1
symmnumber: 1
zpe: 598964.8 jmol-1
zpe.correction: 0.228134 hartree
zpe.thermalcorrener: 0.239887 hartree
zpe.thermalcorrenthalpy: 0.240831 hartree
zpe.thermalcorrgfe: 0.188867 hartree
zpe.sumelectzpe: -514.888925 hartree
zpe.sumelectthermal: -514.877172 hartree
zpe.sumelectthermalent: -514.876228 hartree
zpe.sumelectthermalfe: -514.928192 hartree
dipole: -3.7552 -0.5288 1.2261
dipole: 3.9856
quadrupole: -86.8639 -83.5420 -78.9951
quadrupole: -3.9412 -2.2526 -0.1370
quadrupole: -3.7302 -0.4084 4.1386 -3.9412 -2.2526 -0.1370
hfenergy: -515.1170591 hartree
pointgroup: C01 [X(C9H15Br1O2)]
dipole: 1.4757749 -0.2163172 -0.4838208 debye
polarizability: 156.5823705|-0.4329084|93.8013|-6.2790114|0.2153298|92.8605507 unknown
InChI: InChI=1S/C9H15BrO2/c10-6-8-11-7-9(12-8)4-2-1-3-5-9/h8H,1-7H2
charge 0 multiplicity 1
27 atoms
Br -4.545546 -0.584253 0.566614
O  -0.310606 -0.41192 0.615054
O  -1.720562 1.070311 -0.577516
C  0.50797 0.22179 -0.491033
C  1.316338 1.399408 0.101017
C  1.427286 -0.873759 -1.061111
C  2.346393 0.914651 1.146122
C  2.478854 -1.345009 -0.027768
C  -0.600094 0.682259 -1.465147
C  3.287652 -0.154964 0.542599
C  -1.685728 0.130175 0.541154
C  -2.596638 -1.088349 0.355734
H  0.618823 2.136232 0.541751
H  1.848774 1.906256 -0.731037
H  1.941734 -0.461707 -1.95392
H  0.808217 -1.726311 -1.399226
H  1.804193 0.481672 2.008587
H  2.930068 1.776087 1.522877
H  3.155691 -2.083129 -0.498857
H  1.955159 -1.860584 0.800124
H  -0.340465 1.580149 -2.046327
H  -0.902221 -0.139503 -2.146645
H  3.892753 0.30346 -0.267807
H  3.9991 -0.514692 1.310293
H  -1.935049 0.701219 1.453152
H  -2.399759 -1.838804 1.135198
H  -2.497338 -1.524485 -0.649084
