program: Gaussian 09
title: 000021556
version: EM64L-G09RevD.01
frameworkgroup: C1[X(C10H8N2O2)]
method: RPBEPBE
basis: SDD
operation: Freq
keyword: #p
keyword: freq=noraman
keyword: PBEPBE/SDD
title: #p freq=noraman PBEPBE/SDD
converged: NO NO NO NO
title: Mulliken charges:
elementType: O O N N C C C C C C C C C C H H H H H H H H
charge: -0.235846 -0.235874 -0.054652 -0.054822 0.328023 0.327942 -0.346992 -0.346961 -0.249581 -0.249397 -0.154388 -0.154329 -0.345722 -0.345639 0.279915 0.279889 0.257743 0.257731 0.264037 0.264068 0.257451 0.257402
chargesum: 0.00000
title: Mulliken charges with hydrogens summed into heavy atoms:
elementType: O O N N C C C C C C C C C C
charge: -0.235846 -0.235874 -0.054652 -0.054822 0.328023 0.327942 -0.067076 -0.067072 0.008163 0.008334 0.109649 0.109739 -0.088271 -0.088238
polarizability: 4.00281837e+02 1.21706134e+00 1.12749942e+02 -4.89948708e-03 2.99410917e-03 5.10178856e+01
1716.lowfreq: -14.8550 -1.9888 -0.0011 -0.0008 -0.0002 3.0523 38.4822 47.8252 51.9367
frequency: 38.4819 47.8250 51.9366 119.1903 126.6329 173.5967 211.9729 254.0458 289.6069 333.7161 392.8191 501.5795 508.6730 585.2606 585.3291 644.6433 656.4192 736.6638 736.7901 771.3672 785.3007 828.3205 828.9313 869.8047 869.8514 893.7655 893.9603 907.8154 915.0906 955.5280 969.5242 971.9479 1008.1645 1016.3276 1053.9583 1056.0555 1133.3168 1135.2875 1167.4041 1173.5420 1236.2805 1237.6273 1292.6830 1338.8128 1370.9806 1371.3819 1461.4177 1468.6919 1496.5544 1541.1364 1574.9919 1613.3503 3061.8594 3065.4350 3224.3490 3224.4798 3245.3826 3245.4013 3268.4133 3268.5296
redmass: 5.1278 5.5058 5.5690 4.3585 5.0471 5.4614 3.5634 8.7040 5.7327 3.1274 7.4808 9.3516 5.9211 3.0891 3.0612 4.1983 4.3345 1.2736 1.2722 5.1744 4.5640 1.3077 1.3199 6.4604 6.5705 1.3722 1.3734 4.1820 3.4461 1.4737 1.4744 3.7911 1.5371 1.6916 2.9787 2.9197 1.5674 1.5758 2.6548 2.8117 1.5523 1.4826 1.8502 2.4833 2.6896 2.7060 5.0383 4.8022 5.6144 5.4505 7.4646 8.2416 1.0880 1.0889 1.0915 1.0915 1.0993 1.0993 1.1082 1.1082
irintensity: 0.1307 4.0376 2.1554 0.0002 0.0000 4.4384 0.0000 0.0000 0.2899 38.5577 0.0000 7.0033 0.0002 3.4264 15.4509 7.5416 0.0005 136.9735 34.2355 44.4922 0.0004 50.8269 0.2463 11.7091 2.1577 0.1667 0.0542 0.0034 12.5190 45.0047 0.0026 0.0005 59.7597 0.0047 97.4433 0.1936 9.5955 0.0330 7.8265 0.0021 6.9640 0.0222 58.1853 0.0004 1.0566 3.3929 140.5617 0.0034 0.0180 16.5608 0.0150 221.3335 22.4749 0.0314 11.8328 3.4270 0.3462 0.3076 0.0209 0.0159
temp: 298.150 k
press: 1.00000 atm
elementType: 8 8 7 7 6 6 6 6 6 6 6 6 6 6 1 1 1 1 1 1 1 1
symmnumber: 1
zpe: 417545.8 jmol-1
zpe.correction: 0.159035 hartree
zpe.thermalcorrener: 0.170856 hartree
zpe.thermalcorrenthalpy: 0.171800 hartree
zpe.thermalcorrgfe: 0.119119 hartree
zpe.sumelectzpe: -644.732147 hartree
zpe.sumelectthermal: -644.720325 hartree
zpe.sumelectthermalent: -644.719381 hartree
zpe.sumelectthermalfe: -644.772062 hartree
dipole: -0.0031 0.0025 0.0002
dipole: 0.0040
quadrupole: -45.1198 -75.8355 -85.2110
quadrupole: 4.7463 -0.0003 0.0005
quadrupole: 23.6023 -7.1134 -16.4889 4.7463 -0.0003 0.0005
hfenergy: -644.8911814 hartree
pointgroup: C01 [X(C10H8N2O2)]
dipole: 0.0012127 -0.001001 0.0000675 debye
dipolederiv: 0.1456879 -0.1425973 0.000007 -0.0640741 -0.6148517 0.0000365 0.0000087 0.0000309 -0.1302994 0.146448 -0.1428104 0.0000093 -0.0652038 -0.6146306 0.0000133 0.0000002 0.0000106 -0.1303923 -0.5097573 -0.0262705 0.0000287 0.4118208 -0.1957856 -0.0000059 0.0000031 0.000002 -0.1956333 -0.5087527 -0.0261096 -0.0000222 0.4114425 -0.1953967 0.0000125 -0.0000073 -0.0000032 -0.1958557 -0.5075861 -0.0775442 0.0000091 -0.6225079 0.2308803 -0.0000098 0.0000813 -0.0000109 0.0105067 -0.5082305 -0.0771961 -0.0000109 -0.620429 0.2313884 -0.0000288 -0.0000287 -0.0000117 0.0107289 0.4320952 -0.0607387 -0.0000023 0.1117646 -0.0702447 -0.0000103 -0.0000121 -0.0000067 -0.1625683 0.4312623 -0.0609406 0.0000199 0.1104739 -0.0700477 0.0000014 0.0000115 -0.0000053 -0.1627435 -0.3275776 0.0844756 -0.0000112 0.5173872 -0.0945005 -0.0000089 -0.0000368 -0.0000065 -0.2009 -0.3258587 0.0847694 -0.0000033 0.5173491 -0.0942928 0.0000117 -0.0000252 0.0000014 -0.2005993 -0.5273857 0.1299907 -0.0000108 -0.3370255 0.3500332 -0.0000342 0.0000422 -0.0000379 -0.1241451 -0.528529 0.1302563 -0.0000099 -0.3350281 0.3496346 -0.0000248 0.0000013 -0.0000106 -0.124151 1.0792319 0.0920279 -0.0000268 -0.0084672 0.2841473 -0.0000076 -0.0001234 -0.0000046 -0.0094017 1.0781472 0.0917769 0.0000393 -0.0090327 0.283576 -0.0000077 0.0000855 -0.0000057 -0.0094169 0.0980477 0.0627839 -0.0000019 0.0766642 0.0526982 0.0000111 -0.0000047 0.0000094 0.1969815 0.0981093 0.062675 -0.0000058 0.0765013 0.0524987 0.000006 -0.0000017 0.0000069 0.1969992 -0.0072849 -0.0756501 0.0000074 -0.0923985 0.0687025 0.000011 0.0000053 0.0000107 0.1999782 -0.0074281 -0.0756871 -0.0000046 -0.0926242 0.0686889 0.0000003 -0.0000054 -0.0000002 0.1998824 0.0543687 0.0324047 0.0000003 0.0400044 0.0673605 0.0000092 -0.0000086 0.0000117 0.2228914 0.0549972 0.0321816 -0.0000081 0.0397809 0.0673964 0.0000082 -0.0000033 0.0000069 0.2229799 0.0700067 -0.0186935 0.0000005 -0.0331261 -0.0785785 0.0000109 0.0000323 0.0000027 0.192621 0.0699887 -0.0191039 -0.0000036 -0.0332719 -0.0786761 0.0000058 -0.0000143 0.00001 0.1925374 unknown
polarizability: 400.2847597|0.8004924|112.7470187|0.0048951|-0.0030012|51.0178856 unknown
InChI: InChI=1S/C10H8N2O2/c1-3-9(13-5-1)7-11-12-8-10-4-2-6-14-10/h1-8H
charge 0 multiplicity 1
22 atoms
O  -3.981493 1.145008 -0.000572
O  3.978394 -1.146365 -0.000337
N  -0.636494 -0.323955 -0.000542
N  0.63373 0.325684 -0.00051
C  -2.996161 0.121573 -0.000549
C  2.993723 -0.122706 -0.000416
C  -3.634286 -1.122196 -0.000421
C  3.633405 1.120989 -0.000414
C  -5.051503 -0.876515 -0.000414
C  5.050057 0.873794 -0.000363
C  -5.225784 0.502169 -0.000502
C  5.223724 -0.504863 -0.000305
C  -1.624776 0.560075 -0.000608
C  1.621909 -0.558973 -0.00048
H  -3.122364 -2.081471 -0.000354
H  3.122448 2.080776 -0.000455
H  -5.845009 -1.621043 -0.000349
H  5.84398 1.617887 -0.000357
H  -6.09381 1.155603 -0.000532
H  6.090614 -1.159845 -0.000243
H  -1.431431 1.645459 -0.000629
H  1.426326 -1.643984 -0.000448
