program: Gaussian 09
title: 000228322
version: EM64L-G09RevD.01
frameworkgroup: C1[X(C10H18O)]
method: RPBEPBE
basis: SDD
operation: Freq
keyword: #pfreq=noraman
keyword: PBEPBE/SDD
title: #p freq=noraman PBEPBE/SDD
converged: YES YES NO NO
title: Mulliken charges:
elementType: O C C C C C C C C C C H H H H H H H H H H H H H H H H H H
charge: -0.205764 -0.004940 -0.000767 -0.452226 -0.460232 -0.517604 -0.523664 -0.392030 0.198978 -0.773523 -0.707065 0.181651 0.187170 0.208647 0.211111 0.229512 0.210730 0.241416 0.216575 0.215704 0.241773 0.195691 0.201290 0.208290 0.218475 0.228935 0.217221 0.211454 0.213191
chargesum: 0.00000
title: Mulliken charges with hydrogens summed into heavy atoms:
elementType: O C C C C C C C C C C
charge: -0.205764 0.176710 0.186403 -0.032468 -0.019990 -0.059613 -0.066186 0.004951 0.198978 -0.117822 -0.065199
polarizability: 1.31990979e+02 6.63326484e-02 1.02734851e+02 -2.83653600e+00 4.15192635e-01 8.64505242e+01
1716.lowfreq: -15.8633 -0.0005 0.0001 0.0002 6.2340 14.9992 43.3787 52.9207 61.8777
frequency: 43.2679 52.8246 61.8143 137.5440 151.6788 188.7067 224.0892 258.6308 288.7002 292.3923 361.5186 393.2458 404.7860 411.6434 469.0899 489.3202 516.8162 667.2007 743.2087 757.7552 763.1977 826.8222 831.7873 894.0049 916.9857 940.7266 953.9458 966.9007 995.6646 1031.7206 1042.0643 1065.5146 1080.1414 1097.2449 1127.1377 1130.2532 1159.9216 1178.5891 1199.2169 1238.0213 1249.2452 1258.7285 1268.2582 1276.4340 1301.3455 1310.0592 1320.0660 1325.0943 1334.2976 1342.8030 1356.7056 1382.9912 1392.1989 1437.7022 1446.3855 1461.9296 1465.3643 1474.1263 1474.4197 1479.8191 1486.9852 1496.9920 1635.1497 2921.1296 2941.7627 2961.9154 2967.1391 2969.0088 2971.6634 2973.7064 2976.4639 2978.7272 3025.6233 3043.9905 3053.6716 3066.1909 3067.2136 3069.1661 3070.0449 3074.8280 3081.1746
redmass: 3.2157 1.9182 4.2583 3.0193 2.0800 1.7405 1.2164 1.5271 2.6505 2.4629 2.5080 2.3447 2.0445 3.3301 2.2439 3.2284 2.4122 3.2365 3.1644 1.5724 1.2772 1.8116 2.2077 1.3894 1.9760 2.1708 1.5928 1.4018 1.6769 2.2676 2.6408 1.2577 1.7374 2.7237 1.9306 1.9811 1.8859 2.1323 1.5153 1.2557 1.3502 1.5709 1.2535 1.3192 1.2630 1.4000 1.3160 1.4566 1.5258 1.5341 1.4941 1.2199 1.2002 1.0907 1.0860 1.0777 1.0728 1.0592 1.0623 1.0729 1.0536 1.0499 9.2534 1.0804 1.0822 1.0659 1.0621 1.0660 1.0623 1.0396 1.0377 1.0629 1.0972 1.0970 1.0975 1.0971 1.0957 1.0992 1.0965 1.0991 1.0983
irintensity: 1.4407 0.0317 3.3365 1.0915 0.7629 0.5538 0.0344 0.0424 0.4639 0.1983 0.3492 1.1591 1.1487 2.6899 0.5097 5.3430 0.2061 4.0048 2.9928 1.7251 9.1087 2.0291 0.4130 1.9593 1.8386 17.6463 5.3706 7.5906 19.2038 0.7717 0.6668 0.8996 1.8891 1.0522 7.5125 14.0201 3.3990 29.1664 1.7544 6.7270 1.6064 9.9034 0.8914 5.8937 2.2886 7.5365 4.6092 0.6898 4.2878 5.8098 0.0512 16.0677 13.8848 15.1537 18.8102 7.3193 1.9768 2.6795 14.9712 7.6634 15.1612 12.6169 188.5470 6.0737 15.6269 7.2964 36.7561 4.1503 9.2658 35.4354 33.1890 94.9850 16.3964 43.6666 37.3595 32.6489 22.5244 53.3786 33.8825 70.2785 40.3388
temp: 298.150 k
press: 1.00000 atm
elementType: 8 6 6 6 6 6 6 6 6 6 6 1 1 1 1 1 1 1 1 1 1 1 1 1 1 1 1 1 1
symmnumber: 1
zpe: 679147.6 jmol-1
zpe.correction: 0.258674 hartree
zpe.thermalcorrener: 0.270971 hartree
zpe.thermalcorrenthalpy: 0.271915 hartree
zpe.thermalcorrgfe: 0.219906 hartree
zpe.sumelectzpe: -466.193091 hartree
zpe.sumelectthermal: -466.180794 hartree
zpe.sumelectthermalent: -466.179850 hartree
zpe.sumelectthermalfe: -466.231859 hartree
dipole: -3.5585 0.3116 1.2576
dipole: 3.7870
quadrupole: -89.4041 -67.3537 -68.1186
quadrupole: 2.1341 4.6484 -0.3364
quadrupole: -14.4453 7.6051 6.8402 2.1341 4.6484 -0.3364
hfenergy: -466.4517649 hartree
pointgroup: C01[X(C10H18O1)]
dipole: -1.3974421 0.0958915 0.5078131 debye
polarizability: 131.9492552|0.3631697|102.6883653|-3.130574|0.9703584|86.5387333 unknown
InChI: InChI=1S/C10H18O/c1-3-8(2)9-4-6-10(11)7-5-9/h8-9H,3-7H2,1-2H3
charge 0 multiplicity 1
29 atoms
O  3.830376 -0.256828 -0.517962
C  -0.292896 0.142586 0.262069
C  -1.770008 0.305548 -0.232202
C  0.352049 -1.157739 -0.295173
C  0.618574 1.342833 -0.108667
C  1.794287 -1.38733 0.233721
C  2.071544 1.167138 0.413671
C  -2.703922 -0.741504 0.446156
C  2.681557 -0.167942 -0.006718
C  -2.324538 1.733692 -0.000831
C  -4.069898 -0.924218 -0.252511
H  -0.318026 0.069439 1.374363
H  -1.776926 0.108099 -1.327732
H  0.378167 -1.091428 -1.402661
H  -0.259585 -2.043968 -0.04539
H  0.21487 2.283355 0.306186
H  0.636483 1.459248 -1.212154
H  2.264372 -2.270734 -0.232225
H  1.749455 -1.566124 1.3290
H  2.052161 1.192203 1.52422
H  2.728925 1.985286 0.071572
H  -2.863851 -0.436211 1.501599
H  -2.199708 -1.726042 0.482354
H  -2.226546 2.02603 1.063183
H  -3.39586 1.786884 -0.26482
H  -1.802537 2.489837 -0.612629
H  -4.675515 -1.695579 0.25806
H  -3.93543 -1.243141 -1.303597
H  -4.661674 0.009109 -0.258183
