program: Gaussian 09
title: 000228320
version: EM64L-G09RevD.01
frameworkgroup: C1[X(C13H24O)]
method: RPBEPBE
basis: SDD
operation: Freq
keyword: #pfreq=noraman
keyword: PBEPBE/SDD
title: #p freq=noraman PBEPBE/SDD
converged: YES YES NO NO
title: Mulliken charges:
elementType: O C C C C C C C C C C C C C H H H H H H H H H H H H H H H H H H H H H H H H
charge: -0.188994 -0.016928 -0.001223 -0.560647 -0.189197 -0.579348 -0.058906 -0.027792 0.090388 -0.774509 -0.737753 -0.741788 -0.740144 -0.738275 0.200005 0.209565 0.235522 0.194335 0.260761 0.255256 0.223589 0.208088 0.194543 0.237363 0.231281 0.221834 0.211078 0.213064 0.226471 0.213521 0.209291 0.220579 0.209307 0.212785 0.224641 0.210661 0.210752 0.230821
chargesum: 0.00000
title: Mulliken charges with hydrogens summed into heavy atoms:
elementType: O C C C C C C C C C C C C C
charge: -0.188994 0.183077 0.208342 -0.130789 0.071565 -0.100503 0.149182 0.166752 0.090388 -0.084030 -0.087140 -0.098397 -0.093411 -0.086040
polarizability: 1.57835329e+02 -1.18946648e-01 1.45344019e+02 -2.27442280e-01 -2.34676808e+00 1.15707445e+02
1716.lowfreq: -9.7057 0.0003 0.0004 0.0006 4.7778 15.7425 42.8431 48.7634 79.8371
frequency: 42.1654 48.7468 79.8173 87.6445 106.1270 127.1483 174.4303 201.2954 213.4908 217.1782 226.1544 231.6880 253.3278 265.9615 300.3203 316.5188 355.4191 370.2107 386.9284 402.8522 424.3589 453.4283 462.3308 507.2487 536.7994 614.4672 659.7888 777.6426 794.9589 846.9854 858.0477 876.3179 889.5053 915.2561 916.7612 935.6245 947.3403 956.7785 962.2513 977.1519 1000.5181 1017.0268 1073.2047 1080.9468 1094.8693 1106.1132 1124.4864 1130.5381 1157.7263 1168.6929 1170.1429 1176.6259 1218.7085 1249.5307 1259.4759 1273.4432 1282.5850 1295.0794 1297.6145 1304.6455 1311.3184 1313.4438 1323.1741 1337.5136 1338.0585 1346.6982 1380.3086 1381.1058 1385.3847 1397.8607 1400.4062 1443.0286 1462.3649 1465.9561 1470.9172 1478.2822 1479.7342 1480.8086 1481.4408 1483.8930 1488.4780 1497.0149 1498.3569 1622.9802 2927.6915 2934.3263 2950.2820 2959.6386 2963.5589 2971.0876 2971.2345 2971.6390 2975.0395 2975.3945 2985.7084 3027.1133 3059.5136 3059.5797 3061.4188 3067.2406 3067.7062 3075.7084 3077.4260 3077.6898 3080.0567 3082.0180 3083.7069 3086.1563
redmass: 2.6502 2.9520 4.2030 2.6786 2.5090 2.8486 1.5400 1.7564 1.0761 1.1095 1.2513 1.7301 1.7911 2.2246 2.3054 3.0219 1.9976 2.5534 2.9489 3.1493 2.2340 2.4177 3.0143 2.3843 2.6548 2.6260 3.2377 3.2644 2.5550 2.4674 1.8675 2.0854 2.4712 1.1651 1.1702 1.6110 1.9413 1.4109 1.5018 1.5733 2.1341 1.7740 2.6420 1.4748 2.5079 2.3413 1.8007 2.3499 2.0434 1.8491 1.8250 2.1674 1.5578 2.2932 1.2784 1.2831 1.4435 1.3617 1.2504 1.3189 1.3879 1.4121 1.3923 1.4766 1.3360 1.5567 1.2080 1.2090 1.1929 1.2032 1.2024 1.0872 1.0682 1.0516 1.0599 1.0452 1.0477 1.0499 1.0535 1.0550 1.0579 1.0474 1.0478 8.9002 1.0807 1.0793 1.0818 1.0760 1.0736 1.0374 1.0398 1.0664 1.0372 1.0378 1.0361 1.0844 1.0989 1.0988 1.0937 1.0983 1.0981 1.0982 1.0981 1.0988 1.0972 1.0965 1.0985 1.0957
irintensity: 0.3491 0.8378 2.6039 0.3841 0.3296 0.0657 0.1584 0.0685 0.1266 0.1142 0.0151 0.3834 0.1971 0.8161 0.0136 0.2250 1.1638 0.6162 2.4731 2.3772 0.7739 0.2826 1.6565 0.7025 6.4944 2.8249 0.2665 5.4538 0.1396 1.4361 4.4679 1.9865 9.1387 2.0035 3.6202 9.3874 7.0689 0.4066 0.0670 24.6053 6.3929 7.3285 4.0897 8.9169 9.1207 0.5116 11.8150 2.1741 1.7992 13.8832 1.9508 4.3304 9.5261 49.1628 0.9022 0.6710 6.3862 2.7620 6.4430 21.0195 0.0919 3.9019 1.5422 2.7441 0.3590 6.9966 20.7976 9.1493 29.7560 20.3811 13.7644 16.4661 5.2655 1.8008 4.3364 7.0110 1.3509 5.8261 12.8738 9.2060 4.7524 25.1720 24.4030 181.1835 8.4107 0.1591 14.2737 5.8205 5.6725 19.4741 37.2812 63.7141 45.3611 36.2325 39.3358 15.7539 1.4377 4.2321 25.0280 56.3251 117.3386 2.1589 81.0248 17.8484 105.7151 24.7025 13.1380 25.2616
temp: 298.150 k
press: 1.00000 atm
elementType: 8 6 6 6 6 6 6 6 6 6 6 6 6 6 1 1 1 1 1 1 1 1 1 1 1 1 1 1 1 1 1 1 1 1 1 1 1 1
symmnumber: 1
zpe: 896971.4 jmol-1
zpe.correction: 0.341638 hartree
zpe.thermalcorrener: 0.358251 hartree
zpe.thermalcorrenthalpy: 0.359195 hartree
zpe.thermalcorrgfe: 0.298340 hartree
zpe.sumelectzpe: -583.863507 hartree
zpe.sumelectthermal: -583.846894 hartree
zpe.sumelectthermalent: -583.845950 hartree
zpe.sumelectthermalfe: -583.906806 hartree
dipole: 0.1091 -3.1635 1.8960
dipole: 3.6897
quadrupole: -85.4624 -101.9660 -89.8596
quadrupole: 0.5133 -0.3338 6.6885
quadrupole: 6.9669 -9.5366 2.5697 0.5133 -0.3338 6.6885
hfenergy: -584.2051452 hartree
pointgroup: C01 [X(C13H24O1)]
dipole: -0.0491223 -1.2536733 -0.7302079 debye
polarizability: 157.8373957|0.0181583|145.3980068|-0.0480645|1.9698919|115.6513909 unknown
InChI: InChI=1S/C13H24O/c1-8(2)11-6-12(9(3)4)10(5)13(14)7-11/h8-12H,6-7H2,1-5H3
charge 0 multiplicity 1
38 atoms
O  0.118394 2.969938 1.046554
C  1.162146 -0.342198 0.288087
C  -1.42886 -0.156139 0.224057
C  -0.169626 -0.930409 -0.251332
C  1.30477 1.170106 -0.104234
C  -1.289531 1.358278 -0.120177
C  2.409143 -1.194508 -0.119381
C  -2.749962 -0.752592 -0.36219
C  0.048729 1.930102 0.334615
C  1.566022 1.412174 -1.618504
C  3.729993 -0.576755 0.404942
C  2.299662 -2.656538 0.384192
C  -2.923926 -2.248962 0.001476
C  -4.002982 0.033951 0.098926
H  1.108081 -0.372501 1.400909
H  -1.485898 -0.24576 1.33224
H  -0.253867 -1.978054 0.082934
H  -0.149623 -0.954779 -1.361876
H  2.140982 1.618476 0.462732
H  -2.08775 1.960977 0.342615
H  -1.371646 1.474004 -1.222193
H  2.456567 -1.224819 -1.228824
H  -2.683339 -0.672889 -1.47022
H  1.589278 2.495429 -1.835544
H  2.542515 0.991228 -1.916197
H  0.791931 0.952962 -2.258476
H  4.588123 -1.225255 0.14855
H  3.703209 -0.474795 1.507316
H  3.931534 0.421974 -0.020797
H  3.228466 -3.211666 0.155727
H  2.154062 -2.685264 1.481878
H  1.464703 -3.205655 -0.085144
H  -2.901188 -2.389715 1.099866
H  -3.898394 -2.623345 -0.363237
H  -2.138552 -2.886429 -0.440915
H  -4.070796 0.050723 1.204225
H  -4.922207 -0.444805 -0.286301
H  -4.000862 1.078806 -0.257097
