program: Gaussian 09
title: 000228317
version: EM64L-G09RevD.01
frameworkgroup: C1[X(C15H28O)]
method: RPBEPBE
basis: SDD
operation: Freq
keyword: #pfreq=noraman
keyword: PBEPBE/SDD
title: #p freq=noraman PBEPBE/SDD
converged: NO YES NO NO
title: Mulliken charges:
elementType: O C C C C C C C C C C C C C C C H H H H H H H H H H H H H H H H H H H H H H H H H H H H
charge: -0.199053 0.003252 -0.151502 -0.108129 -0.545550 -0.545217 0.069494 -0.038986 -0.079783 -0.060342 -0.742293 -0.739067 -0.715118 -0.728236 -0.735303 -0.746828 0.194640 0.230065 0.217238 0.220803 0.212266 0.222329 0.230247 0.198522 0.204605 0.225829 0.207185 0.212184 0.227267 0.206457 0.213140 0.223484 0.229783 0.209417 0.218225 0.216823 0.214639 0.220969 0.220300 0.206797 0.208946 0.254773 0.208538 0.207191
chargesum: 0.00000
title: Mulliken charges with hydrogens summed into heavy atoms:
elementType: O C C C C C C C C C C C C C C C
charge: -0.199053 0.197892 0.078563 0.109109 -0.112481 -0.092642 0.069494 0.159536 0.124823 0.165487 -0.095657 -0.095986 -0.057693 -0.075805 -0.099260 -0.076326
polarizability: 1.76607585e+02 -9.87286106e-01 1.68325035e+02 -2.21044941e+00 -1.33553950e+00 1.36892757e+02
1716.lowfreq: -11.6686 -0.0008 -0.0007 0.0006 5.4336 16.8249 25.4858 40.2715 52.0575
frequency: 25.2082 40.1908 51.8477 76.0043 85.5598 99.6217 126.7655 141.6288 174.7900 191.3486 198.2149 216.4912 220.3411 233.1079 244.8609 251.7901 268.2406 282.2366 306.6118 330.3659 355.2367 379.2417 383.9857 403.9662 410.4811 432.4611 444.0887 487.7602 546.1254 560.6018 636.2698 710.4176 743.4349 809.5174 822.5612 857.7589 869.3321 880.6986 908.4716 915.0520 918.6340 921.0960 941.8543 952.2196 954.6601 962.3790 964.7299 988.2786 1022.5615 1049.3397 1063.5123 1089.0310 1095.9876 1105.5609 1130.2886 1141.6235 1158.0368 1162.5788 1167.6383 1171.4094 1190.0462 1200.5016 1235.8547 1246.0049 1252.8903 1266.7606 1272.6481 1291.0370 1299.9753 1311.2486 1313.7349 1319.6780 1324.5586 1332.9819 1340.4389 1347.8076 1355.7011 1378.2764 1380.1735 1381.7818 1394.3350 1398.6877 1399.5658 1458.5451 1464.6173 1467.1803 1467.3858 1469.9944 1474.2497 1475.2876 1478.8116 1480.8772 1484.5676 1487.8166 1491.1123 1493.5044 1493.7416 1614.3111 2917.7120 2932.1968 2950.0968 2965.5381 2967.4266 2969.4166 2970.1765 2972.0393 2973.5754 2975.6660 2977.3467 2981.1794 2985.6565 2999.2350 3047.1481 3052.6694 3057.2763 3058.1788 3063.2862 3064.2198 3066.1184 3068.6530 3071.2648 3073.1880 3075.6937 3077.3677 3081.9685 3089.7048
redmass: 2.3864 2.7870 3.5622 3.0566 2.4469 3.1195 2.9580 3.3454 1.3087 1.6168 1.2038 1.1935 1.1729 1.3480 1.3423 1.5630 2.8152 2.3804 3.1569 2.6416 2.3323 2.8128 2.1896 2.3575 2.6316 3.0736 2.4855 2.2337 2.7346 3.5526 3.4791 4.0156 2.6853 2.8281 2.4947 2.4305 1.7798 2.0488 1.8155 1.1717 1.2253 1.2804 1.6694 1.4353 1.5061 1.5977 1.7880 2.1266 2.1280 1.5415 1.5095 2.0780 2.5500 2.1642 1.8247 2.4285 2.2966 2.0996 1.8541 1.8378 2.0586 1.9871 1.4093 1.4161 1.2560 1.4124 1.3924 1.2978 1.3438 1.3802 1.4439 1.3881 1.4017 1.3830 1.6347 1.4509 1.4957 1.2143 1.2074 1.2116 1.2050 1.2030 1.2169 1.0711 1.0531 1.0539 1.0573 1.0525 1.0518 1.0498 1.0573 1.0565 1.0573 1.0521 1.0475 1.0583 1.0476 9.4623 1.0795 1.0797 1.0838 1.0360 1.0734 1.0370 1.0720 1.0380 1.0375 1.0374 1.0516 1.0479 1.0825 1.0846 1.0981 1.0959 1.0991 1.0988 1.0991 1.0996 1.0979 1.0983 1.0990 1.0994 1.0985 1.0978 1.0976 1.0995
irintensity: 0.0096 0.2030 1.0395 0.0677 0.0489 1.8002 0.2659 0.6839 0.1304 0.6390 0.4974 0.1398 0.2438 0.4012 0.4582 0.2048 1.9278 0.0751 1.6318 1.6230 0.1730 0.3880 0.4211 0.2244 1.3248 1.6113 0.3655 0.0766 1.8796 4.8013 2.0815 2.9046 3.1042 3.9423 2.9107 2.7646 11.4367 1.3532 9.1945 3.0905 1.7550 11.7751 8.5706 0.3950 5.5543 0.5082 3.0475 1.4195 17.6969 10.4593 6.7598 3.7203 6.6303 0.5407 6.3535 2.6344 5.9051 4.0729 6.8670 16.0733 1.0374 29.5068 0.8222 1.7582 22.2800 1.4523 4.2399 8.7767 2.3467 1.8363 0.4489 3.6267 5.4468 4.3510 11.0693 4.0751 1.4701 11.5152 21.1902 26.6939 19.7284 23.1885 11.1021 7.4576 4.0775 0.2846 2.4380 2.7084 12.3463 1.7651 10.0884 3.4353 17.6494 8.7157 20.7079 2.6098 26.6444 138.6749 23.3215 1.9543 17.6230 28.8672 22.0645 27.7740 17.3162 37.0195 36.8414 28.4660 3.6372 65.7555 11.2743 41.6934 26.6238 41.2830 28.0224 1.3782 19.1703 4.8236 105.5765 87.6261 34.8184 65.8970 79.6891 24.9908 40.5313 24.7746
temp: 298.150 k
press: 1.00000 atm
elementType: 8 6 6 6 6 6 6 6 6 6 6 6 6 6 6 6 1 1 1 1 1 1 1 1 1 1 1 1 1 1 1 1 1 1 1 1 1 1 1 1 1 1 1 1
symmnumber: 1
zpe: 1041378.0 jmol-1
zpe.correction: 0.396640 hartree
zpe.thermalcorrener: 0.416188 hartree
zpe.thermalcorrenthalpy: 0.417133 hartree
zpe.thermalcorrgfe: 0.349179 hartree
zpe.sumelectzpe: -662.310929 hartree
zpe.sumelectthermal: -662.291381 hartree
zpe.sumelectthermalent: -662.290437 hartree
zpe.sumelectthermalfe: -662.358390 hartree
dipole: -2.5479 -0.9179 1.8057
dipole: 3.2549
quadrupole: -107.2517 -102.1185 -104.3903
quadrupole: -3.9557 5.5465 3.5482
quadrupole: -2.6649 2.4683 0.1966 -3.9557 5.5465 3.5482
hfenergy: -662.7075691 hartree
pointgroup: C01 [X(C15H28O1)]
dipole: 1.0175231 0.3727676 0.6823598 debye
polarizability: 176.6351525|-1.0203267|168.408423|1.6896367|0.150402|136.7818018 unknown
InChI: InChI=1S/C15H28O/c1-9(2)12-7-13(10(3)4)15(16)14(8-12)11(5)6/h9-14H,7-8H2,1-6H3
charge 0 multiplicity 1
44 atoms
O  -2.102716 -1.270417 -1.333097
C  1.337714 0.713645 -0.039543
C  0.226855 -1.561138 -0.655977
C  -1.226773 0.393711 0.252119
C  1.342107 -0.521551 -0.97937
C  -0.063817 1.37734 -0.091468
C  -1.131531 -0.849199 -0.6454
C  2.478058 1.721528 -0.40386
C  0.46581 -2.35198 0.683007
C  -2.644421 1.039375 0.25708
C  2.436569 2.998069 0.473848
C  3.882183 1.073421 -0.296017
C  -0.737892 -3.268324 1.011728
C  1.763877 -3.191549 0.609772
C  -2.850928 1.927896 1.506796
C  -2.962891 1.822911 -1.039452
H  1.525287 0.373584 1.003615
H  0.183069 -2.312562 -1.470214
H  -1.024429 0.025442 1.285203
H  2.320732 -1.031197 -0.958521
H  1.198498 -0.162833 -2.020592
H  -0.220613 1.78935 -1.108995
H  -0.115992 2.227348 0.612017
H  2.32289 2.02897 -1.461882
H  0.579763 -1.620626 1.509928
H  -3.364235 0.197369 0.30835
H  2.479474 2.737078 1.549493
H  3.303735 3.647041 0.25138
H  1.5248 3.596472 0.303722
H  4.056742 0.68516 0.726796
H  4.669884 1.819462 -0.509391
H  4.018672 0.238788 -1.005525
H  -1.672101 -2.696394 1.157226
H  -0.544933 -3.845574 1.934862
H  -0.919368 -3.986371 0.189764
H  1.898424 -3.770874 1.542121
H  1.716637 -3.911863 -0.229554
H  2.665137 -2.567452 0.474665
H  -3.88196 2.327079 1.532886
H  -2.162981 2.795243 1.511914
H  -2.686372 1.358473 2.441749
H  -2.816624 1.188387 -1.93029
H  -4.016906 2.157473 -1.031798
H  -2.330535 2.725389 -1.135897
