program: Gaussian 09
title: 000228316
version: EM64L-G09RevD.01
frameworkgroup: C1[X(C17H32O2)]
method: RPBEPBE
basis: SDD
operation: Freq
keyword: #pfreq=noraman
keyword: PBEPBE/SDD
title: #p freq=noraman PBEPBE/SDD
converged: YES YES NO NO
title: Mulliken charges:
elementType: O O C C C C C C C C C C C C C C C C C H H H H H H H H H H H H H H H H H H H H H H H H H H H H H H H H
charge: -0.295640 -0.255355 -0.082985 -0.078974 0.005415 -0.142088 -0.529264 -0.557735 -0.063215 -0.039576 -0.039083 -0.739980 -0.743482 -0.746006 -0.757405 -0.744622 -0.745314 0.291994 -0.769060 0.217528 0.208141 0.193829 0.292703 0.210156 0.211743 0.209182 0.224414 0.212054 0.223436 0.198364 0.222442 0.212334 0.213125 0.209477 0.228999 0.215520 0.226497 0.211740 0.205131 0.210915 0.204869 0.244738 0.205892 0.209914 0.225354 0.206230 0.209347 0.228065 0.248889 0.245141 0.246206
chargesum: 0.00000
title: Mulliken charges with hydrogens summed into heavy atoms:
elementType: O O C C C C C C C C C C C C C C C C C
charge: -0.295640 -0.255355 0.134543 0.129166 0.199244 0.150615 -0.107365 -0.124139 0.148840 0.183860 0.159281 -0.092080 -0.089486 -0.102638 -0.096883 -0.103462 -0.101672 0.291994 -0.028823
polarizability: 2.02504138e+02 1.34260261e+00 1.86364238e+02 -3.66759462e-01 -1.61516987e+00 1.73524898e+02
1716.lowfreq: -22.3240 -20.2967 -0.0007 0.0001 0.0006 5.2300 14.5612 24.4112 32.8237
frequency: -21.3895 23.1715 32.6520 40.5456 43.8883 45.5595 75.5624 80.3336 93.4880 117.0827 136.8767 167.8912 191.8711 196.2456 208.6458 215.6586 219.0921 229.8123 240.3149 277.3234 280.2956 299.7095 307.3710 314.7180 361.0988 366.6632 379.1980 411.1647 415.1446 422.1758 443.2192 467.4513 482.4873 498.4742 511.2893 576.5444 593.6974 612.4325 674.8526 779.9574 801.7104 839.5565 850.3465 871.1142 881.5233 888.6787 902.9660 912.7318 913.7837 918.3696 919.8793 938.6104 952.9186 954.1147 956.4007 973.0749 982.2317 998.4575 1045.0777 1054.8328 1065.3018 1079.0163 1085.1346 1091.7846 1099.8758 1129.9692 1148.6131 1155.6816 1166.2614 1169.0040 1170.8869 1179.4767 1185.0195 1204.5969 1236.4066 1247.4253 1262.2017 1270.8298 1280.8761 1301.3186 1306.1332 1315.4919 1316.6755 1318.0417 1326.8608 1334.1503 1336.6224 1339.8406 1346.3641 1365.1921 1371.0933 1378.4614 1379.9510 1381.6197 1384.3025 1394.9760 1398.9655 1400.4743 1454.0483 1455.6438 1459.1344 1462.7429 1464.8765 1468.0942 1468.4049 1477.7985 1480.0748 1480.4532 1481.8640 1484.0337 1486.7733 1498.5105 1499.4936 1502.3647 1631.4402 2925.7676 2935.1996 2947.8572 2958.6671 2966.3296 2968.2143 2968.3306 2970.1354 2972.0766 2972.9771 2975.7156 2980.6039 2983.6062 2990.7608 3006.6919 3055.0240 3056.3011 3057.6211 3061.7660 3063.3760 3063.6132 3063.9766 3069.2077 3071.3405 3072.6411 3077.0353 3079.2863 3081.6029 3082.8248 3087.9624 3095.1191 3136.4336
redmass: 1.1227 6.0289 3.1289 2.5104 2.7007 2.8551 2.6501 3.1069 2.8642 3.0025 2.7978 1.8276 1.3215 2.3171 1.1519 1.2666 1.3078 1.4595 1.5141 1.9542 3.0392 2.2637 2.6127 2.5544 2.4926 2.3841 2.2014 2.3886 2.2280 2.1964 2.4648 3.0867 2.8873 2.4676 2.7127 3.3431 3.4408 4.7432 3.2531 2.2910 2.9005 2.9204 2.7638 2.3816 2.4022 2.0715 2.1451 1.3931 1.4199 1.3022 1.6322 1.8538 1.4511 1.4631 1.4554 1.9844 2.1315 1.7531 1.6256 1.6102 1.6394 2.2372 2.0057 2.0828 2.4940 2.1511 1.9418 2.3867 1.8815 1.8109 1.8440 2.2839 1.6615 3.7134 1.4060 1.5333 1.3295 1.3441 1.2992 1.3209 1.3072 1.4150 1.3517 1.3920 1.3664 1.5504 1.3618 1.3677 1.4648 1.3478 1.3778 1.2189 1.2165 1.2355 1.2377 1.2044 1.1977 1.2024 1.0784 1.0691 1.0466 1.0681 1.0520 1.0570 1.0541 1.0463 1.0544 1.0478 1.0538 1.0557 1.0565 1.0474 1.0480 1.0509 10.2847 1.0793 1.0802 1.0843 1.0798 1.0375 1.0555 1.0383 1.0515 1.0377 1.0361 1.0372 1.0793 1.0766 1.0733 1.0362 1.0981 1.0985 1.0954 1.0957 1.0981 1.0987 1.0977 1.0984 1.0985 1.0987 1.0982 1.0969 1.0972 1.0965 1.0858 1.0973 1.1012
irintensity: 1.9990 1.3476 0.5978 0.0709 0.0745 0.2262 1.4325 0.1137 0.4925 0.0637 0.5857 0.2421 0.0700 4.0049 0.3722 0.4790 0.1683 0.7883 1.8902 0.2010 2.9398 0.0608 0.8522 0.9992 0.5422 1.5519 0.6256 0.7615 0.1110 0.9374 1.3550 6.2923 2.6453 0.8561 0.8775 3.3514 2.1916 3.9924 0.3044 0.3606 2.6295 2.7831 7.0309 11.2769 8.1415 5.1944 21.1409 14.9905 8.2454 16.6911 47.2663 5.5061 3.2815 2.3095 1.5405 20.7726 0.6897 38.0444 6.8325 3.5326 4.1726 5.5156 3.6211 6.5638 2.6088 6.0410 40.3047 21.1159 8.8432 6.5479 2.4226 29.6634 4.6469 343.9619 2.1340 0.2439 2.3632 1.8647 2.5219 2.5668 0.3718 1.3517 2.8502 4.0963 3.0290 1.1097 4.1133 2.9622 0.2132 9.0671 2.5126 6.6887 17.9573 48.3694 41.9201 20.1231 13.8082 21.0093 4.1312 13.7160 14.7553 11.0068 3.4032 3.2395 1.6577 4.3519 4.9242 4.7753 4.0529 10.2985 18.3266 22.4453 25.7991 17.5621 169.5781 2.9737 13.6170 22.6179 6.4808 26.9552 20.4523 29.7898 37.6293 39.4549 31.6947 27.8060 31.6140 17.6197 63.3646 4.6320 3.7204 3.1232 20.9794 26.3779 51.5471 15.5178 140.4252 63.7171 25.1389 70.3544 89.8883 52.8411 52.3167 12.9757 4.1288 7.1637 9.9853
temp: 298.150 k
press: 1.00000 atm
elementType: 8 8 6 6 6 6 6 6 6 6 6 6 6 6 6 6 6 6 6 1 1 1 1 1 1 1 1 1 1 1 1 1 1 1 1 1 1 1 1 1 1 1 1 1 1 1 1 1 1 1 1
symmnumber: 1
zpe: 1198473.1 jmol-1
zpe.correction: 0.456474 hartree
zpe.thermalcorrener: 0.479233 hartree
zpe.thermalcorrenthalpy: 0.480177 hartree
zpe.thermalcorrgfe: 0.403840 hartree
zpe.sumelectzpe: -815.914064 hartree
zpe.sumelectthermal: -815.891305 hartree
zpe.sumelectthermalent: -815.890361 hartree
zpe.sumelectthermalfe: -815.966699 hartree
dipole: -1.5440 -1.1273 0.3979
dipole: 1.9527
quadrupole: -128.2371 -122.4862 -113.5545
quadrupole: -6.6126 3.1363 -1.3086
quadrupole: -6.8112 -1.0602 7.8714 -6.6126 3.1363 -1.3086
hfenergy: -816.3705384 hartree
pointgroup: C01 [X(C17H32O2)]
dipole: 0.673345 -0.3068242 -0.2066035 debye
polarizability: 202.534957|0.8175537|184.8173142|0.9607459|4.4245393|175.0410028 unknown
InChI: InChI=1S/C17H32O2/c1-10(2)14-8-15(11(3)4)17(19-13(7)18)16(9-14)12(5)6/h10-12,14-17H,8-9H2,1-7H3
charge 0 multiplicity 1
51 atoms
O  -1.30695 -0.016958 -1.329082
O  -3.355655 1.04664 -0.961882
C  -0.195456 1.377972 0.387594
C  -0.196257 -1.209018 0.49853
C  2.016516 0.080231 -0.005662
C  -0.985274 0.0684 0.146501
C  1.152874 1.313706 -0.378906
C  1.184858 -1.216683 -0.212243
C  -0.040019 1.709681 1.912527
C  -1.016621 -2.513219 0.227253
C  3.354522 0.042746 -0.814396
C  0.566739 3.121973 2.108498
C  -1.387536 1.624839 2.676643
C  -0.241757 -3.781364 0.666229
C  -2.401302 -2.493201 0.92453
C  4.210627 1.315903 -0.589448
C  4.208668 -1.207184 -0.482432
C  -2.525209 0.521303 -1.742172
C  -2.702677 0.376927 -3.240388
H  -0.806279 2.200757 -0.04239
H  -0.020217 -1.159182 1.597349
H  2.292329 0.148152 1.071378
H  -1.951717 0.110491 0.67103
H  1.714539 2.247892 -0.20903
H  0.935505 1.266769 -1.465363
H  1.022669 -1.366541 -1.300379
H  1.763583 -2.08256 0.151787
H  0.657918 0.978167 2.369521
H  -1.184149 -2.572549 -0.868098
H  3.086148 -0.002778 -1.893342
H  1.571391 3.217631 1.660072
H  0.66006 3.355667 3.185216
H  -0.085248 3.891959 1.652021
H  -1.271025 2.01528 3.70475
H  -2.16641 2.226754 2.17061
H  -1.764989 0.58964 2.760891
H  0.688271 -3.927225 0.08978
H  -0.865997 -4.682536 0.521059
H  0.026342 -3.728678 1.740072
H  -2.925205 -3.453762 0.763592
H  -2.291057 -2.353909 2.018435
H  -3.060286 -1.693323 0.543504
H  4.440345 1.447699 0.486462
H  5.172565 1.236983 -1.129491
H  3.707209 2.231991 -0.944628
H  4.418123 -1.261186 0.604117
H  5.180253 -1.163272 -1.009109
H  3.713305 -2.14727 -0.7811
H  -1.836407 -0.119345 -3.700956
H  -2.843217 1.375355 -3.689889
H  -3.618245 -0.204659 -3.445764
