program: Gaussian 09
title: 000228315
version: EM64L-G09RevD.01
frameworkgroup: C1[X(C15H30O)]
method: RPBEPBE
basis: SDD
operation: Freq
keyword: #pfreq=noraman
keyword: PBEPBE/SDD
title: #p freq=noraman PBEPBE/SDD
converged: YES YES NO NO
title: Mulliken charges:
elementType: O C C C C C C C C C C C C C C C H H H H H H H H H H H H H H H H H H H H H H H H H H H H H H
charge: -0.443201 -0.049456 -0.049594 0.010689 -0.246470 -0.575139 -0.574991 -0.021139 -0.021389 -0.042214 -0.740136 -0.762626 -0.762813 -0.739986 -0.742552 -0.742527 0.189947 0.189936 0.197238 0.263568 0.184945 0.231772 0.231750 0.184945 0.213834 0.213820 0.196557 0.218727 0.212977 0.204439 0.251788 0.207758 0.201118 0.252024 0.207709 0.201170 0.218655 0.212985 0.204444 0.207651 0.210384 0.226434 0.207647 0.210375 0.226433 0.322513
chargesum: 0.00000
title: Mulliken charges with hydrogens summed into heavy atoms:
elementType: O C C C C C C C C C C C C C C C
charge: -0.120689 0.140491 0.140342 0.207927 0.017099 -0.158422 -0.158295 0.192696 0.192431 0.154343 -0.103993 -0.101961 -0.101911 -0.103903 -0.098084 -0.098072
polarizability: 1.79802710e+02 -5.09537662e-03 1.77191191e+02 1.19326586e+00 -8.56892728e-05 1.32275982e+02
1716.lowfreq: -8.4158 -0.0005 -0.0004 0.0006 13.4547 14.6834 36.7998 37.2054 39.5420
frequency: 36.7296 36.9569 39.2804 79.1035 87.9828 106.1961 124.7747 126.8737 181.5818 191.0688 203.4752 207.8178 224.3264 228.7753 245.0134 251.7989 279.1693 287.7504 289.9087 309.3319 310.8539 356.7929 361.2165 392.0162 411.1339 422.4699 438.2737 440.4864 476.5643 497.0705 520.7828 613.0332 659.2389 796.6848 802.3136 826.3944 858.5473 871.0959 891.7978 894.4386 911.5243 915.9512 916.0576 923.6097 942.5601 954.9800 956.2811 957.2412 983.6357 993.8401 1055.5776 1056.0186 1071.4049 1085.7120 1094.1230 1099.4455 1127.3647 1145.4987 1148.6667 1168.6665 1169.8074 1171.7712 1178.5661 1181.0908 1191.8525 1223.6265 1243.8813 1268.1068 1272.9886 1275.2769 1294.2544 1295.2208 1301.4853 1314.8065 1315.4719 1320.5809 1328.8510 1329.0008 1338.5441 1348.4856 1353.1394 1371.4210 1378.7682 1379.1557 1380.2144 1394.1659 1394.8677 1395.6939 1458.7153 1464.4438 1464.6750 1469.1508 1471.4658 1477.2219 1479.9489 1480.4940 1481.0110 1481.5083 1483.7898 1495.9512 1498.6621 1499.3568 2916.2069 2920.0432 2927.2285 2930.5398 2937.6777 2950.7198 2966.3990 2966.6084 2968.8811 2969.2105 2969.3963 2972.4226 2976.7587 2978.1753 3049.2079 3053.2563 3054.3964 3054.6238 3058.5351 3062.6570 3063.1754 3065.5088 3071.7401 3073.1114 3075.1490 3076.4991 3079.3709 3082.4245 3085.0848 3553.3067
redmass: 2.4188 2.4765 2.4236 3.4663 3.5329 2.4372 3.0837 2.9496 1.2715 1.5384 1.1156 1.2030 1.2966 1.3666 2.5893 1.6386 1.1824 1.9104 2.0456 2.3280 2.7593 1.9109 2.6558 2.5124 2.3145 2.2331 2.3471 2.7127 2.5902 2.8561 2.1114 2.7741 2.4852 3.3591 2.7779 3.0581 2.4291 1.5289 2.4391 2.3486 1.1652 1.1673 1.2799 2.1495 1.5739 1.4063 1.4083 1.4177 2.1310 2.2775 1.8220 2.0825 1.6279 1.3899 2.3735 2.3647 2.4325 1.7413 1.8512 1.7615 1.8027 2.2891 2.2718 1.9550 1.7434 1.5481 1.3354 1.3446 1.2293 1.2184 1.3333 1.3544 1.3074 1.4045 1.4127 1.5855 1.4311 1.5166 1.4672 1.4779 1.4925 1.1772 1.2202 1.2147 1.2160 1.2044 1.2033 1.2071 1.0757 1.0600 1.0526 1.0601 1.0731 1.0473 1.0514 1.0523 1.0511 1.0493 1.0582 1.0473 1.0461 1.0467 1.0749 1.0728 1.0775 1.0773 1.0810 1.0812 1.0371 1.0371 1.0454 1.0366 1.0438 1.0369 1.0753 1.0769 1.0912 1.0916 1.0983 1.0983 1.0986 1.0977 1.0975 1.0979 1.0911 1.0988 1.0959 1.0969 1.0972 1.0985 1.0952 1.0653
irintensity: 0.0007 0.0015 0.0002 1.1424 0.7344 0.0010 0.0565 0.0659 0.6538 0.3750 1.1407 0.0840 0.0218 0.4199 3.8632 0.2617 117.6311 10.1338 0.0048 0.0076 0.1417 0.2341 4.4451 0.0086 0.1989 0.5659 0.8968 0.7124 2.0861 0.2298 0.2790 5.6418 2.9707 12.7753 8.1354 11.9066 14.4842 5.7622 11.7437 21.8371 2.3138 6.0790 4.3885 9.6647 1.2859 0.0945 1.0365 0.2579 0.0504 9.0623 5.7297 14.1579 12.6543 0.3399 1.0475 2.3349 1.8715 33.1039 4.1445 16.2435 15.3253 6.0008 14.5550 1.4953 10.0632 4.1370 4.0331 0.3095 1.5332 4.6016 6.9277 1.4161 0.9970 7.2160 10.5047 0.0016 3.1700 1.4583 8.1818 2.5299 0.2664 15.1382 21.7889 12.2059 47.2302 12.9101 17.8368 14.0014 5.1170 5.3062 0.3812 1.0143 12.4095 6.8142 0.5150 2.1721 14.9926 10.2999 6.7002 20.1296 17.1746 35.2238 2.5404 3.7596 0.6517 5.3714 12.9658 97.2472 16.5481 39.4062 38.5314 27.8137 13.4492 34.5023 2.5346 80.3315 25.9295 49.5769 2.4069 3.9340 0.7428 87.8467 76.4616 115.1872 32.0984 21.5250 144.9121 32.1517 17.2138 43.5871 12.2723 1.2902
temp: 298.150 k
press: 1.00000 atm
elementType: 8 6 6 6 6 6 6 6 6 6 6 6 6 6 6 6 1 1 1 1 1 1 1 1 1 1 1 1 1 1 1 1 1 1 1 1 1 1 1 1 1 1 1 1 1 1
symmnumber: 1
zpe: 1100044.5 jmol-1
zpe.correction: 0.418985 hartree
zpe.thermalcorrener: 0.439128 hartree
zpe.thermalcorrenthalpy: 0.440072 hartree
zpe.thermalcorrgfe: 0.371156 hartree
zpe.sumelectzpe: -663.480168 hartree
zpe.sumelectthermal: -663.460024 hartree
zpe.sumelectthermalent: -663.459080 hartree
zpe.sumelectthermalfe: -663.527996 hartree
dipole: 1.7641 -0.0037 -0.7681
dipole: 1.9240
quadrupole: -108.0504 -104.5926 -103.3836
quadrupole: 0.0065 4.4555 -0.0121
quadrupole: -2.7082 0.7496 1.9586 0.0065 4.4555 -0.0121
hfenergy: -663.8991524 hartree
pointgroup: C01 [X(C15H30O1)]
dipole: 0.700241 -0.0096669 0.2873461 debye
polarizability: 179.7303226|-0.0204839|177.1903438|-2.2003825|0.234223|132.349216 unknown
InChI: InChI=1S/C15H30O/c1-9(2)12-7-13(10(3)4)15(16)14(8-12)11(5)6/h9-16H,7-8H2,1-6H3
charge 0 multiplicity 1
46 atoms
O  -1.677272 0.039612 -1.567378
C  -0.663083 -1.267986 0.322369
C  -0.633332 1.307206 0.333587
C  1.601472 -0.005661 0.201111
C  -1.397736 0.03009 -0.109045
C  0.795577 -1.264984 -0.2097
C  0.825178 1.275525 -0.198396
C  -1.439431 -2.562684 -0.085284
C  -1.380088 2.622715 -0.062214
C  3.050639 -0.019809 -0.390706
C  -0.783541 -3.837018 0.504424
C  -2.930153 -2.510258 0.331551
C  -2.872898 2.598681 0.350332
C  -0.697767 3.875747 0.543134
C  3.865628 1.231924 0.023143
C  3.836123 -1.294412 0.010041
H  -0.61778 -1.242156 1.435664
H  -0.5889 1.270747 1.446644
H  1.697492 -0.011829 1.311591
H  -2.406123 0.039642 0.332096
H  0.78664 -1.347712 -1.320737
H  1.31274 -2.167424 0.157007
H  1.362493 2.16286 0.176202
H  0.818381 1.36833 -1.308659
H  -1.408523 -2.630903 -1.192723
H  -1.344679 2.702416 -1.168765
H  2.953202 -0.012938 -1.499535
H  0.248072 -3.992905 0.142243
H  -1.367871 -4.734157 0.227278
H  -0.752621 -3.786159 1.610851
H  -3.482211 -1.735067 -0.22667
H  -3.421518 -3.479699 0.12665
H  -3.03531 -2.304694 1.415514
H  -3.440902 1.844141 -0.219963
H  -3.341295 3.581854 0.157527
H  -2.985722 2.38066 1.431074
H  0.337794 4.012992 0.184734
H  -1.261791 4.788537 0.275163
H  -0.670273 3.811501 1.648957
H  3.917206 1.318088 1.126318
H  4.902064 1.161934 -0.356213
H  3.43248 2.167654 -0.371313
H  3.886974 -1.392494 1.112261
H  4.873514 -1.245235 -0.370044
H  3.380148 -2.21561 -0.392814
H  -0.811498 0.031239 -2.049407
