program: Gaussian 09
title: 000228312
version: EM64L-G09RevD.01
frameworkgroup: C1[X(C12H24O)]
method: RPBEPBE
basis: SDD
operation: Freq
keyword: #pfreq=noraman
keyword: PBEPBE/SDD
title: #p freq=noraman PBEPBE/SDD
converged: YES YES NO NO
title: Mulliken charges:
elementType: O C C C C C C C C C C C C H H H H H H H H H H H H H H H H H H H H H H H H
charge: -0.441466 -0.040144 -0.032605 -0.239217 -0.483378 -0.489367 -0.429205 -0.015743 -0.066699 -0.757501 -0.743110 -0.738838 -0.731803 0.198125 0.208912 0.259690 0.222975 0.186322 0.189034 0.215613 0.201544 0.203162 0.216144 0.208960 0.198678 0.209067 0.248055 0.203598 0.212507 0.220987 0.215096 0.211717 0.219086 0.210692 0.212139 0.218219 0.318756
chargesum: 0.00000
title: Mulliken charges with hydrogens summed into heavy atoms:
elementType: O C C C C C C C C C C C C
charge: -0.122710 0.157980 0.176307 0.020473 -0.074082 -0.084720 -0.024499 0.200401 0.142260 -0.101701 -0.106018 -0.092939 -0.090752
polarizability: 1.44267555e+02 -1.01430848e+00 1.29941085e+02 2.79592829e-01 1.92257140e-01 1.13325520e+02
1716.lowfreq: -15.6306 -8.0368 0.0006 0.0007 0.0007 14.4870 29.5491 45.8296 68.1006
frequency: 28.9865 45.3378 68.0617 113.8727 158.9459 174.0301 193.8766 205.7015 215.5536 218.0735 234.8352 251.3322 269.9959 301.2067 333.1366 346.8237 373.3359 402.5344 408.2248 423.5783 457.0228 475.5229 495.4285 600.3820 654.5077 745.0467 804.7771 828.3849 860.0918 870.0581 880.6873 909.5839 916.9832 921.1898 948.0808 952.5013 959.8564 963.3943 967.8179 1036.3552 1058.4936 1064.9777 1072.9184 1099.0256 1128.9353 1137.1339 1144.4608 1166.4032 1171.7268 1175.8532 1198.3302 1207.1687 1247.0469 1257.4225 1277.8625 1282.7084 1296.3362 1310.3711 1320.2819 1324.6091 1330.9523 1335.1838 1338.0092 1342.4257 1362.7740 1376.1150 1378.5429 1386.5752 1395.1103 1397.8857 1463.5326 1465.6876 1470.3209 1471.5774 1474.8554 1478.4520 1481.5135 1482.6130 1490.4234 1498.2256 1500.2136 2931.3576 2943.9266 2945.4238 2960.2362 2964.2499 2967.6199 2968.7982 2971.8973 2974.8410 2978.2385 2979.4551 3030.5525 3035.7356 3042.8411 3053.3077 3059.2145 3062.1915 3066.3773 3067.4400 3071.0557 3076.8052 3079.6024 3087.1078 3554.0574
redmass: 2.4744 2.4856 3.4428 2.8095 2.2920 2.3309 1.6124 1.1696 1.2081 1.1585 1.2409 1.5910 2.9951 2.5336 2.3750 2.3129 2.7801 2.1907 2.2445 2.3701 2.7643 2.6201 2.4382 3.1540 2.1717 2.5295 2.1436 2.7273 2.3983 1.6499 2.3205 1.5424 1.1923 1.4980 2.8783 1.5545 1.5348 1.7551 1.5605 1.6507 1.8561 1.8453 1.4047 2.7214 1.7075 1.8473 2.0473 2.0173 1.7929 1.6976 1.5862 1.5672 1.2768 1.3388 1.3920 1.4491 1.2608 1.3556 1.4060 1.5868 1.4247 1.4211 1.4412 1.4210 1.4790 1.2050 1.2093 1.1744 1.2020 1.1964 1.0566 1.0540 1.0790 1.0627 1.0652 1.0504 1.0587 1.0542 1.0626 1.0487 1.0566 1.0781 1.0710 1.0714 1.0797 1.0372 1.0442 1.0360 1.0457 1.0689 1.0701 1.0746 1.0978 1.0911 1.0952 1.0982 1.0993 1.0975 1.0982 1.0985 1.0983 1.0974 1.0929 1.0925 1.0653
irintensity: 0.1357 0.0005 0.3166 0.4192 0.3813 1.9797 1.9278 28.7431 8.3958 80.6536 7.6075 0.3048 9.0139 0.1095 2.6175 0.3758 0.6637 0.1363 1.5206 1.4692 1.4559 0.8390 4.1405 2.0585 6.0968 5.2576 8.8091 6.6670 9.8483 8.1960 11.9084 9.6180 6.7136 12.7241 27.5972 0.2098 0.8424 0.2826 15.0486 5.8250 0.7563 2.7555 12.0050 0.8276 3.0081 43.8102 14.7177 1.8031 11.1062 4.6465 8.8793 13.1558 3.6727 1.3433 1.4704 0.8787 1.0042 1.2162 1.6202 4.8791 5.7788 1.4276 0.6255 0.2668 1.3985 9.8083 23.3841 20.6453 13.9037 19.1466 3.5477 2.7277 10.4761 4.1947 6.3804 3.6882 3.7263 10.2120 35.7072 30.5370 6.2313 1.7511 22.3270 53.3994 11.5968 30.8821 27.9504 28.0666 11.7521 37.0882 42.1721 62.9270 57.1136 58.6211 44.1212 2.3549 0.8812 111.6155 49.2407 73.7861 35.0966 62.5628 41.9913 20.0369 1.4391
temp: 298.150 k
press: 1.00000 atm
elementType: 8 6 6 6 6 6 6 6 6 6 6 6 6 1 1 1 1 1 1 1 1 1 1 1 1 1 1 1 1 1 1 1 1 1 1 1 1
symmnumber: 1
zpe: 883744.3 jmol-1
zpe.correction: 0.336600 hartree
zpe.thermalcorrener: 0.352283 hartree
zpe.thermalcorrenthalpy: 0.353227 hartree
zpe.thermalcorrgfe: 0.294442 hartree
zpe.sumelectzpe: -545.807864 hartree
zpe.sumelectthermal: -545.792181 hartree
zpe.sumelectthermalent: -545.791237 hartree
zpe.sumelectthermalfe: -545.850022 hartree
dipole: -0.6737 1.1022 -1.6125
dipole: 2.0661
quadrupole: -83.9485 -81.6814 -88.9810
quadrupole: 0.9559 -0.8276 3.0320
quadrupole: 0.9218 3.1889 -4.1107 0.9559 -0.8276 3.0320
hfenergy: -546.1444642 hartree
pointgroup: C01 [X(C12H24O1)]
dipole: 0.2603251 -0.5002428 -0.5854466 debye
polarizability: 144.2366553|-1.2340125|129.758027|-0.0805372|-1.8900408|113.5394765 unknown
InChI: InChI=1S/C12H24O/c1-8(2)10-6-5-7-11(9(3)4)12(10)13/h8-13H,5-7H2,1-4H3
charge 0 multiplicity 1
37 atoms
O  -0.506525 0.143252 2.209857
C  -1.015229 -0.126964 -0.235349
C  1.430841 0.003556 0.636775
C  -0.046465 0.45922 0.833631
C  -0.9075 -1.678074 -0.252774
C  1.488121 -1.551286 0.64064
C  0.549995 -2.171846 -0.420638
C  -2.485243 0.369139 -0.047111
C  2.122186 0.640976 -0.616964
C  -2.576403 1.913858 0.023773
C  -3.416659 -0.153718 -1.169825
C  1.921848 2.177146 -0.685085
C  3.640606 0.329489 -0.633588
H  -0.663895 0.247838 -1.223618
H  1.983423 0.375752 1.526407
H  -0.093108 1.558157 0.824599
H  -1.528149 -2.090898 -1.068228
H  -1.332894 -2.087405 0.69045
H  1.194261 -1.926509 1.645102
H  2.525267 -1.902797 0.492645
H  0.582988 -3.2769 -0.354716
H  0.907731 -1.907949 -1.436132
H  -2.845844 -0.029472 0.924031
H  1.678692 0.203241 -1.535537
H  -2.107312 2.382599 -0.864481
H  -3.634038 2.235874 0.050831
H  -2.087357 2.312539 0.928819
H  -3.056434 0.173696 -2.165353
H  -4.439965 0.243982 -1.037243
H  -3.491641 -1.255448 -1.180515
H  2.23269 2.657667 0.263005
H  2.536131 2.60886 -1.497152
H  0.872345 2.460771 -0.881274
H  4.129191 0.729202 0.276392
H  4.123698 0.801339 -1.509428
H  3.851452 -0.753338 -0.683391
H  -0.490605 -0.840148 2.328943
