program: Gaussian 09
title: 000228311
version: EM64L-G09RevD.01
frameworkgroup: C1[X(C12H22O)]
method: RPBEPBE
basis: SDD
operation: Freq
keyword: #pfreq=noraman
keyword: PBEPBE/SDD
title: #p freq=noraman PBEPBE/SDD
converged: YES YES NO NO
title: Mulliken charges:
elementType: O C C C C C C C C C C C C H H H H H H H H H H H H H H H H H H H H H H
charge: -0.199795 0.004307 -0.144503 -0.537738 -0.462362 -0.032774 -0.084459 -0.536074 0.142269 -0.735063 -0.740748 -0.726594 -0.715172 0.194392 0.233598 0.212413 0.221017 0.227572 0.210460 0.197587 0.208246 0.222360 0.239633 0.222257 0.214014 0.206019 0.227819 0.212337 0.206895 0.214902 0.216771 0.221645 0.215762 0.208836 0.234173
chargesum: 0.00000
title: Mulliken charges with hydrogens summed into heavy atoms:
elementType: O C C C C C C C C C C C C
charge: -0.199795 0.198699 0.089094 -0.104308 -0.024329 0.164812 0.123787 -0.074082 0.142269 -0.092774 -0.093696 -0.073277 -0.056401
polarizability: 1.46632654e+02 -2.75637677e+00 1.29735651e+02 2.62037782e+00 5.57387266e-01 1.08045978e+02
1716.lowfreq: -14.8159 -2.1775 0.0006 0.0008 0.0010 9.6448 43.6213 47.0298 62.8288
frequency: 43.2106 46.9876 62.7103 84.7054 136.2441 160.2127 173.6146 193.8441 215.9972 222.7409 232.2713 281.4175 295.5260 327.3773 354.5222 382.6656 394.9404 400.4084 428.9614 458.3801 489.1526 513.7491 579.1087 700.7202 737.6788 782.5902 825.1248 854.6459 875.3642 904.5576 914.1763 918.2170 937.7947 948.5820 957.5203 959.2072 965.6162 1028.5935 1048.9407 1083.6503 1091.8529 1100.8268 1125.8290 1137.2704 1163.6915 1167.4766 1172.5060 1185.7214 1238.0620 1243.5037 1257.5161 1265.0108 1272.7655 1296.4905 1308.4826 1311.5379 1320.7499 1323.1313 1330.8254 1340.9073 1356.0490 1379.0409 1381.6352 1396.1094 1400.4229 1452.9920 1458.3232 1464.6004 1467.8194 1469.2082 1475.0051 1477.3223 1481.0768 1484.6874 1493.1876 1496.1050 1626.5152 2933.2774 2951.9563 2965.9103 2968.8686 2969.3826 2972.0316 2972.8993 2973.6204 2975.3109 2976.2704 3001.4828 3046.6743 3052.4474 3058.6621 3063.7829 3066.0344 3068.0482 3071.4599 3073.3817 3076.0541 3076.9535 3080.7311
redmass: 2.8315 2.5044 3.3896 3.5697 2.8429 2.0372 1.5604 1.1476 1.2123 1.4415 1.3969 2.2888 2.7187 2.5563 2.4681 2.2475 2.5992 2.3245 2.9996 2.5975 2.1999 2.7640 3.6917 3.6221 2.9875 1.8971 2.0867 2.5430 1.7628 2.1270 1.1707 1.2541 1.7212 1.6448 1.4734 1.5295 2.0399 2.1895 1.6272 2.0558 2.2021 1.8961 1.6611 2.3958 2.0507 1.8012 1.8298 1.9967 1.3831 1.4508 1.5156 1.3882 1.4001 1.3229 1.3465 1.3816 1.4074 1.4498 1.3869 1.4834 1.4892 1.2142 1.2085 1.2040 1.2033 1.0891 1.0702 1.0539 1.0525 1.0687 1.0522 1.0500 1.0560 1.0579 1.0569 1.0479 9.1089 1.0795 1.0831 1.0672 1.0674 1.0396 1.0368 1.0377 1.0723 1.0510 1.0533 1.0851 1.0965 1.0956 1.0985 1.0996 1.0977 1.0966 1.0989 1.0994 1.0988 1.0982 1.0977
irintensity: 0.5586 0.0929 1.6805 1.3912 0.8527 0.3720 0.2325 0.2270 0.0794 0.1297 0.3117 0.6166 0.3514 1.5439 0.1021 0.4876 0.1185 0.1088 2.3809 2.5765 1.1874 5.1592 0.0048 1.0273 2.4098 4.9257 1.9626 1.4844 5.1331 10.3969 4.0649 2.8131 8.9956 4.8875 7.4035 2.8705 3.9145 9.6814 4.4086 4.9055 2.0926 2.1114 14.7580 1.7124 6.3230 7.1958 12.1877 19.6192 2.4543 6.0448 12.4548 0.6889 7.2423 3.2904 6.3249 1.7712 2.5508 9.1793 5.8504 2.7287 0.9416 14.2740 19.0002 19.5428 18.6497 15.3230 10.1057 6.8630 2.4110 5.5035 13.4462 5.1097 3.0073 10.6857 8.5532 26.0258 169.4226 1.4230 13.7576 15.9723 5.1140 27.6157 33.6053 34.3452 39.6777 55.6977 17.5241 42.2658 35.4343 33.4644 1.5866 3.4969 93.9946 30.1568 41.9010 59.1321 79.7115 26.9540 38.2334
temp: 298.150 k
press: 1.00000 atm
elementType: 8 6 6 6 6 6 6 6 6 6 6 6 6 1 1 1 1 1 1 1 1 1 1 1 1 1 1 1 1 1 1 1 1 1 1
symmnumber: 1
zpe: 823815.7 jmol-1
zpe.correction: 0.313775 hartree
zpe.thermalcorrener: 0.328998 hartree
zpe.thermalcorrenthalpy: 0.329942 hartree
zpe.thermalcorrgfe: 0.271800 hartree
zpe.sumelectzpe: -544.640873 hartree
zpe.sumelectthermal: -544.625649 hartree
zpe.sumelectthermalent: -544.624705 hartree
zpe.sumelectthermalfe: -544.682847 hartree
dipole: -2.5710 2.0623 -1.5543
dipole: 3.6441
quadrupole: -88.8355 -86.8540 -82.4970
quadrupole: 8.2638 -4.7076 3.7602
quadrupole: -2.7733 -0.7918 3.5652 8.2638 -4.7076 3.7602
hfenergy: -544.9546475 hartree
pointgroup: C01 [X(C12H22O1)]
dipole: 1.0272961 -0.7855435 -0.6189081 debye
polarizability: 146.7253622|-2.3459413|129.6161008|-2.8219801|-0.5581676|108.0728198 unknown
InChI: InChI=1S/C12H22O/c1-8(2)10-5-6-12(13)11(7-10)9(3)4/h8-11H,5-7H2,1-4H3
charge 0 multiplicity 1
35 atoms
O  -2.356199 1.895699 0.976563
C  1.259271 0.109689 -0.111018
C  -1.209983 -0.250187 0.668798
C  0.305979 -0.43201 0.990015
C  0.939912 1.608313 -0.359781
C  2.760949 -0.120376 0.262979
C  -1.729851 -1.159847 -0.503093
C  -0.561697 1.857464 -0.680405
C  -1.470129 1.230685 0.373462
C  3.100473 -1.626494 0.401509
C  3.728675 0.525681 -0.760549
C  -1.526788 -2.660023 -0.182252
C  -3.223916 -0.878285 -0.795891
H  1.070398 -0.44608 -1.056939
H  -1.804002 -0.509258 1.568518
H  0.530735 0.107474 1.934546
H  0.501621 -1.499637 1.189922
H  1.544313 2.003215 -1.195902
H  1.218869 2.19031 0.543256
H  2.934517 0.363284 1.249755
H  -1.14848 -0.925437 -1.418823
H  -0.794938 1.398727 -1.663933
H  -0.785238 2.936182 -0.7499
H  2.523141 -2.12055 1.202267
H  4.172315 -1.760839 0.63759
H  2.897813 -2.161301 -0.547206
H  3.64954 1.626676 -0.778311
H  4.776368 0.273642 -0.512439
H  3.527539 0.151156 -1.783558
H  -2.033555 -2.929459 0.764384
H  -1.960809 -3.284919 -0.984803
H  -0.46061 -2.932959 -0.089475
H  -3.841731 -1.077135 0.100413
H  -3.588953 -1.52719 -1.613332
H  -3.402151 0.172091 -1.088667
