program: Gaussian 09
title: 000228310
version: EM64L-G09RevD.01
frameworkgroup: C1[X(C14H26O2)]
method: RPBEPBE
basis: SDD
operation: Freq
keyword: #pfreq=noraman
keyword: PBEPBE/SDD
title: #p freq=noraman PBEPBE/SDD
converged: YES YES NO NO
title: Mulliken charges:
elementType: O O C C C C C C C C C C C C C C H H H H H H H H H H H H H H H H H H H H H H H H H H
charge: -0.292720 -0.256909 -0.062068 0.020903 -0.546820 -0.069783 -0.453846 -0.493743 -0.044537 -0.042296 -0.754514 -0.738127 -0.739809 -0.742012 0.297419 -0.761910 0.192391 0.186459 0.216357 0.211581 0.278607 0.212248 0.206962 0.230474 0.205930 0.220531 0.198493 0.206859 0.210159 0.244666 0.204560 0.212337 0.222992 0.206061 0.209759 0.225173 0.206376 0.209165 0.226136 0.245378 0.245830 0.245290
chargesum: 0.00000
title: Mulliken charges with hydrogens summed into heavy atoms:
elementType: O O C C C C C C C C C C C C C C
charge: -0.292720 -0.256909 0.130323 0.207362 -0.118881 0.208824 -0.034635 -0.057340 0.175993 0.156197 -0.092830 -0.098238 -0.098816 -0.100336 0.297419 -0.025413
polarizability: 1.75788011e+02 -2.57569454e+00 1.54436037e+02 -1.40384554e+00 7.41769967e-01 1.34616149e+02
1716.lowfreq: -10.9444 -0.0006 -0.0006 0.0000 7.8135 14.5540 20.5989 27.5187 39.1019
frequency: 17.0088 27.2035 39.0170 44.0995 53.5759 74.0844 108.4353 125.8888 145.3237 174.0644 185.7417 202.7655 210.2458 225.0377 230.0919 269.2283 301.8413 317.9338 343.5713 358.2257 377.9989 401.0523 420.1642 436.6303 444.1352 478.6013 500.7414 540.6171 566.3585 608.4253 640.7357 773.8088 798.0003 833.3671 849.0267 876.4585 885.9649 899.2406 912.3976 916.2704 929.6754 940.3116 953.4684 959.4944 965.8666 975.0678 996.9930 1041.4838 1062.5275 1073.4424 1084.6225 1088.7898 1099.4134 1130.5942 1146.8700 1153.2913 1167.8563 1173.1206 1182.6034 1204.6600 1213.4063 1240.2343 1257.4800 1263.9162 1291.2413 1301.4579 1312.0593 1318.9450 1320.7986 1324.6724 1333.0891 1338.4765 1345.3349 1356.9422 1372.6789 1377.3568 1379.4673 1381.7262 1394.4785 1395.3457 1453.6413 1455.5835 1456.2438 1457.9202 1464.9845 1467.4258 1470.7166 1476.0044 1477.7382 1481.2460 1483.0720 1494.7353 1496.9679 1638.2197 2913.8075 2928.4983 2948.2086 2967.3341 2968.0796 2970.1080 2971.7068 2974.7175 2974.8525 2978.8531 2982.4524 3004.3096 3040.2741 3046.6554 3052.3278 3055.9844 3056.5556 3059.8104 3064.1366 3064.7280 3074.0767 3076.2516 3079.1356 3080.6937 3097.8240 3137.5142
redmass: 1.1743 3.9524 2.7049 3.1900 2.5075 3.1488 2.5541 3.1274 2.2823 1.6605 1.3135 2.1490 2.2447 1.3504 1.3646 1.9352 2.1364 2.7838 2.5507 2.0094 2.4353 2.5605 2.4388 2.5631 2.6437 2.7329 2.3815 2.7758 3.5340 3.7315 3.4076 1.9181 2.8221 2.6916 2.8978 2.3172 2.1884 2.7028 1.1775 1.1856 2.5703 1.9771 1.4544 1.5788 1.7335 1.8121 1.7999 1.6507 1.8133 2.6898 1.7467 1.7752 1.7478 1.9832 2.0268 2.0202 1.7676 1.7809 2.2542 2.6849 1.6054 1.3824 1.2758 1.3013 1.2520 1.2924 1.4032 1.4245 1.4830 1.4109 1.4784 1.3527 1.6486 1.4634 1.3951 1.2320 1.2255 1.2463 1.2076 1.2037 1.0613 1.0705 1.0654 1.0817 1.0570 1.0640 1.0728 1.0462 1.0444 1.0568 1.0581 1.0473 1.0479 9.4643 1.0808 1.0804 1.0842 1.0369 1.0368 1.0423 1.0372 1.0649 1.0630 1.0671 1.0745 1.0381 1.0957 1.1014 1.0868 1.0984 1.0988 1.0967 1.0980 1.0976 1.0987 1.0980 1.0976 1.0973 1.0943 1.1023
irintensity: 0.8414 1.2328 0.1211 0.8822 0.0634 1.9089 0.3739 0.3944 0.6317 2.2135 0.6097 3.8075 2.1118 0.6782 0.5109 0.3393 0.1194 1.4974 0.6725 2.2794 0.4965 0.1211 1.5202 1.4884 4.0907 0.6605 0.5948 0.8741 5.2668 2.7953 3.1643 0.4269 3.3366 11.1643 3.0639 12.6926 7.5187 27.9411 3.4509 8.4775 13.4004 20.2757 2.6611 8.5541 32.8424 5.7063 59.5998 10.2826 4.2970 2.0202 5.2432 1.2809 3.0908 3.7292 35.5757 11.2797 11.4345 2.0056 36.3792 288.1355 54.1039 2.9280 3.8814 2.2354 2.5442 1.8919 0.2150 3.1291 1.1898 3.1400 0.5866 2.9703 1.2855 7.7068 1.9274 17.9963 29.2384 52.6174 19.4853 16.4469 22.4134 5.3812 17.1905 14.9537 3.4223 1.4273 5.0469 4.0901 7.1848 6.8865 6.8666 22.0831 23.7737 185.2925 8.6143 14.7443 24.6367 27.2238 29.4493 24.6199 38.5265 20.1073 25.9046 8.2312 61.4236 3.3822 39.1968 39.4245 12.6800 0.7880 0.9151 53.3275 58.3965 129.8267 30.5851 81.8330 46.2341 18.2085 9.7026 10.3323
temp: 298.150 k
press: 1.00000 atm
elementType: 8 8 6 6 6 6 6 6 6 6 6 6 6 6 6 6 1 1 1 1 1 1 1 1 1 1 1 1 1 1 1 1 1 1 1 1 1 1 1 1 1 1
symmnumber: 1
zpe: 979777.7 jmol-1
zpe.correction: 0.373178 hartree
zpe.thermalcorrener: 0.392559 hartree
zpe.thermalcorrenthalpy: 0.393503 hartree
zpe.thermalcorrgfe: 0.323624 hartree
zpe.sumelectzpe: -698.247435 hartree
zpe.sumelectthermal: -698.228054 hartree
zpe.sumelectthermalent: -698.227110 hartree
zpe.sumelectthermalfe: -698.296988 hartree
dipole: -1.7071 0.5474 1.1911
dipole: 2.1524
quadrupole: -108.9325 -100.1745 -98.0580
quadrupole: 3.3755 7.7562 -4.7545
quadrupole: -6.5442 2.2138 4.3303 3.3755 7.7562 -4.7545
hfenergy: -698.6206124 hartree
pointgroup: C01 [X(C14H26O2)]
dipole: -0.70105 -0.1659031 -0.4450637 debye
polarizability: 176.0225944|1.6453224|154.1594898|-0.3558955|1.4414292|134.6581132 unknown
InChI: InChI=1S/C14H26O2/c1-9(2)12-6-7-14(16-11(5)15)13(8-12)10(3)4/h9-10,12-14H,6-8H2,1-5H3
charge 0 multiplicity 1
42 atoms
O  1.470043 0.714053 -0.510873
O  3.409757 1.496935 0.530622
C  0.194599 -1.153766 0.433226
C  -1.998121 0.258264 0.44569
C  -1.117922 -0.778173 -0.308348
C  0.994029 0.115935 0.792719
C  -1.151405 1.516604 0.774149
C  0.144565 1.161692 1.531933
C  1.046043 -2.206364 -0.34868
C  -3.292441 0.613663 -0.354842
C  2.403182 -2.500367 0.340432
C  0.274705 -3.536236 -0.542281
C  -4.156586 -0.636004 -0.66315
C  -4.164973 1.664089 0.379475
C  2.689161 1.393137 -0.490203
C  2.990453 1.988406 -1.850548
H  -0.08053 -1.610561 1.412263
H  -2.319576 -0.20006 1.410466
H  -1.70221 -1.698408 -0.478281
H  -0.855907 -0.368327 -1.305968
H  1.894314 -0.119229 1.386233
H  -1.735671 2.228736 1.384446
H  -0.89349 2.032439 -0.173174
H  0.756305 2.064341 1.717395
H  -0.109922 0.739489 2.526159
H  1.257289 -1.778067 -1.350302
H  -2.969892 1.05475 -1.324099
H  2.253518 -2.843519 1.383306
H  2.940086 -3.30227 -0.199677
H  3.068044 -1.619063 0.364437
H  -0.006949 -3.972774 0.436302
H  0.907808 -4.27506 -1.067829
H  -0.646715 -3.409433 -1.136917
H  -4.431642 -1.162246 0.272056
H  -5.094808 -0.342025 -1.169672
H  -3.63889 -1.355953 -1.320201
H  -4.432305 1.310043 1.394652
H  -5.107039 1.838963 -0.172854
H  -3.65616 2.638426 0.481883
H  2.515603 2.983829 -1.928188
H  2.586388 1.356228 -2.656548
H  4.077461 2.115489 -1.966711
