program: Gaussian 09
title: 000228300
version: EM64L-G09RevD.01
frameworkgroup: C1[X(C8H14O)]
method: RPBEPBE
basis: SDD
operation: Freq
keyword: #pfreq=noraman
keyword: PBEPBE/SDD
title: #p freq=noraman PBEPBE/SDD
converged: YES YES NO NO
title: Mulliken charges:
elementType: O C C C C C C C C H H H H H H H H H H H H H H
charge: -0.200532 0.008887 -0.432650 -0.553761 -0.410024 -0.387650 -0.494048 0.174417 -0.709367 0.206974 0.212164 0.188643 0.211722 0.252376 0.212872 0.211676 0.194962 0.201597 0.244855 0.213524 0.223152 0.213160 0.217052
chargesum: 0.00000
title: Mulliken charges with hydrogens summed into heavy atoms:
elementType: O C C C C C C C C
charge: -0.200532 0.215861 -0.031842 -0.089664 0.014523 0.008909 -0.035669 0.174417 -0.056003
polarizability: 9.69012887e+01 1.28399261e+00 8.82114714e+01 1.30846994e+00 2.00304119e+00 6.96595062e+01
1716.lowfreq: -19.4718 -11.6156 0.0005 0.0006 0.0007 10.2165 75.8626 89.1228 106.7324
frequency: 75.8012 89.1170 106.7225 200.4585 215.9449 259.1132 342.3625 377.2635 407.2583 437.7262 468.9225 497.4099 625.6076 747.0683 768.6461 817.9075 852.8306 860.9341 886.1813 925.6078 958.3133 1009.9525 1030.8595 1051.2343 1072.8877 1096.3067 1117.5561 1125.3721 1190.9411 1212.7148 1229.5703 1247.3914 1273.2804 1279.1447 1283.1130 1303.0253 1329.3439 1337.1710 1342.3696 1348.6416 1392.7710 1438.4317 1446.1793 1460.4932 1468.6021 1473.1879 1480.1446 1489.1942 1632.4677 2945.9118 2956.9229 2957.3455 2967.3330 2971.1962 2979.6297 2982.5702 3011.3269 3029.3380 3045.5533 3071.0396 3072.5784 3075.1028 3080.1034
redmass: 2.4986 3.5139 2.2173 2.4590 1.4441 1.4778 3.2874 3.1208 2.0582 2.7420 2.0595 2.8958 3.6585 1.8679 1.2923 2.6343 1.5614 1.5794 2.4193 2.0567 1.7653 1.6117 2.2292 1.1165 1.9095 2.1200 2.4104 2.0298 1.8216 1.3797 1.4723 1.6747 1.2180 1.2507 1.3591 1.3742 1.3526 1.4628 1.4705 1.5919 1.2105 1.0919 1.0885 1.0844 1.0758 1.0872 1.0487 1.0535 9.1373 1.0765 1.0632 1.0627 1.0664 1.0664 1.0366 1.0618 1.1005 1.0975 1.1020 1.0959 1.0990 1.0972 1.0984
irintensity: 1.1022 2.3572 1.0703 0.0698 0.8631 0.1489 0.5625 0.6478 1.6949 0.7381 2.1703 8.4867 1.5760 4.1872 7.7216 1.6395 2.2278 7.2439 4.2297 5.7016 7.2022 11.0679 7.7229 5.0628 3.2242 3.0227 4.4105 2.2926 12.6024 1.6494 16.4286 30.8329 1.0008 15.7367 5.4430 13.3502 2.5003 7.3264 3.1182 0.2594 14.7899 11.3696 15.0049 3.4788 10.9567 8.9994 8.8717 13.6719 178.3790 1.4389 1.7889 18.8680 59.0159 35.1562 31.7163 31.4935 13.2805 65.2823 52.9016 39.4531 35.7012 31.1902 47.8374
temp: 298.150 k
press: 1.00000 atm
elementType: 8 6 6 6 6 6 6 6 6 1 1 1 1 1 1 1 1 1 1 1 1 1 1
symmnumber: 1
zpe: 533710.9 jmol-1
zpe.correction: 0.203280 hartree
zpe.thermalcorrener: 0.212769 hartree
zpe.thermalcorrenthalpy: 0.213713 hartree
zpe.thermalcorrgfe: 0.168690 hartree
zpe.sumelectzpe: -387.750418 hartree
zpe.sumelectthermal: -387.740929 hartree
zpe.sumelectthermalent: -387.739985 hartree
zpe.sumelectthermalfe: -387.785008 hartree
dipole: 1.7952 3.0868 0.9667
dipole: 3.6994
quadrupole: -58.9869 -62.6075 -54.6944
quadrupole: -7.1918 -2.0213 -2.0169
quadrupole: -0.2239 -3.8446 4.0685 -7.1918 -2.0213 -2.0169
hfenergy: -387.9536981 hartree
pointgroup: C01 [X(C8H14O1)]
dipole: 0.779528 -1.1654113 -0.3905037 debye
dipolederiv: -0.6753772 0.1790972 0.0830919 0.2171303 -0.8093471 -0.1216369 0.1898385 -0.2287477 -0.3444364 0.0826654 -0.0467427 0.0348632 -0.1556525 0.1207976 -0.0069678 0.0955912 -0.0384553 0.1562473 -0.0405611 -0.0247914 -0.0000909 0.0031834 0.0397867 0.0027766 0.0021921 0.0395379 0.1517432 -0.5034002 0.0913074 0.0901277 0.0807305 -0.0751043 0.0164914 0.0892727 -0.0042887 0.1075586 0.055077 -0.0794055 0.0004267 -0.0407743 0.1561237 0.0077046 -0.0066203 -0.0414101 0.1574814 0.0760187 -0.0228317 0.0126368 -0.0018051 0.066901 -0.0112573 -0.023483 -0.0123429 0.159698 -0.0835648 -0.1025692 -0.0350637 -0.0887317 -0.3742687 -0.0498306 -0.0095338 -0.0438315 0.104715 1.0220448 -0.0224995 -0.1910164 -0.0234074 0.9706447 0.2434102 -0.3197421 0.3591563 0.1481463 -0.0348008 -0.076054 -0.0071298 -0.0580065 -0.0044644 -0.0244686 0.0120826 -0.0168229 0.0794363 0.0350162 0.0099313 0.0131386 0.0180096 0.0166469 -0.0262431 -0.009659 -0.0209917 -0.1769941 -0.030139 0.1218902 -0.0547125 0.0978111 -0.0937007 0.0653164 -0.0586217 0.0896036 0.0341008 0.0384116 -0.0164416 0.0227233 -0.0232413 0.0595647 -0.0018089 0.034872 -0.0726174 -0.1810561 0.0689613 0.0117339 0.0185505 -0.0120262 0.0949052 -0.0600017 0.0034724 -0.0025037 -0.1171256 0.0411294 -0.060418 -0.0090943 -0.0916189 -0.1039214 -0.0204815 -0.0263417 -0.0361589 0.0691257 0.0407847 0.0268505 -0.0103667 0.0403818 0.0652583 -0.040691 0.0284811 0.0250996 -0.170255 -0.027555 -0.0907009 -0.015692 -0.1117515 -0.171837 -0.0168724 -0.0300357 -0.043981 0.0752999 0.0346911 -0.0250549 -0.0389586 -0.0241802 0.0472073 -0.0403299 0.022704 -0.0583866 -0.1862305 -0.0289409 0.0681114 -0.0259286 0.0994109 -0.1413156 0.069591 -0.0433819 0.0874477 0.0410871 -0.1453719 -0.0010928 0.0396404 0.0353519 0.0485605 -0.0021146 0.0710356 0.0121411 0.0741219 0.109617 -0.0159699 0.0352143 -0.0040806 0.0557977 -0.0199412 -0.0212822 -0.0114128 -0.1281701 0.0824175 0.095583 -0.0557059 0.0482297 -0.1030704 0.0724013 -0.0492425 0.0882833 0.0294044 0.0966782 0.0000533 0.0437022 -0.0199488 0.059059 -0.0215934 -0.0150548 -0.0579963 -0.1668513 -0.2138019 -0.0199861 0.0496438 0.0149856 0.0757762 -0.0134529 0.0634566 -0.0113221 0.0829531 unknown
polarizability: 97.0310406|-0.7382796|88.0469337|-1.3747687|2.1054986|69.694292 unknown
InChI: InChI=1S/C8H14O/c1-2-7-4-3-5-8(9)6-7/h7H,2-6H2,1H3
charge 0 multiplicity 1
23 atoms
O  -2.012297 1.846973 0.360672
C  0.871339 -0.298679 0.241802
C  0.179022 -1.649372 -0.072803
C  0.086959 0.871571 -0.427119
C  -1.304122 -1.658676 0.360562
C  2.359784 -0.318722 -0.191818
C  -2.098641 -0.503406 -0.31131
C  -1.403294 0.838331 -0.088242
C  3.171261 0.928172 0.222372
H  0.836105 -0.14425 1.342663
H  0.724046 -2.470441 0.432761
H  0.247516 -1.845416 -1.164153
H  0.195024 0.77185 -1.529153
H  0.489444 1.855383 -0.13314
H  -1.368039 -1.549849 1.461681
H  -1.77627 -2.626036 0.105528
H  2.409673 -0.446601 -1.293752
H  2.835755 -1.21953 0.247017
H  -3.133696 -0.440524 0.065867
H  -2.142635 -0.691672 -1.40475
H  2.802408 1.843978 -0.273515
H  3.117642 1.091564 1.315302
H  4.236616 0.811951 -0.048369
