program: Gaussian 09
title: 000228287
version: EM64L-G09RevD.01
frameworkgroup: C1[X(C14H13NO)]
method: RPBEPBE
basis: SDD
operation: Freq
keyword: #p
keyword: freq=noraman
keyword: PBEPBE/SDD
title: #p freq=noraman PBEPBE/SDD
converged: YES YES NO NO
title: Mulliken charges:
elementType: O N C C C C C C C C C C C C C C H H H H H H H H H H H H H
charge: -0.437268 -0.238380 0.184143 0.216521 0.180370 0.191133 -0.422707 -0.365664 -0.358061 -0.395090 -0.395395 -0.308547 -0.228326 -0.229846 -0.253263 -0.253588 0.243001 0.215901 0.263404 0.232287 0.236112 0.235688 0.221402 0.209001 0.225102 0.223059 0.224606 0.224314 0.360092
chargesum: 0.00000
title: Mulliken charges with hydrogens summed into heavy atoms:
elementType: O N C C C C C C C C C C C C C C
charge: -0.077176 -0.238380 0.184143 0.216521 0.180370 0.191133 0.036195 -0.102260 -0.125774 -0.158978 -0.159708 0.121855 -0.003224 -0.006787 -0.028657 -0.029275
polarizability: 2.35508613e+02 -1.76778081e+01 1.79224475e+02 -7.51384666e+00 -1.69036609e+01 7.80394956e+01
1716.lowfreq: -7.5289 -0.0004 0.0006 0.0007 4.8502 8.3270 48.9028 63.5658 107.8150
frequency: 48.8381 63.5615 107.8137 113.2588 148.8526 195.5917 218.4718 278.4840 288.9787 355.7411 379.8854 419.2177 425.2382 450.3499 463.6221 524.7678 555.3770 577.4974 580.1888 595.2617 613.7527 706.8048 730.2244 746.6224 754.2732 756.8138 778.3140 820.3219 851.1802 857.6130 870.5558 926.0758 934.1143 938.2636 972.6825 974.5913 989.1788 1013.1891 1016.3844 1023.0638 1060.7888 1078.3982 1122.3856 1131.8082 1168.4195 1170.6506 1178.0249 1209.0612 1236.7047 1267.2817 1312.0782 1329.4171 1340.4486 1345.8224 1351.3823 1375.5896 1401.2818 1407.8171 1448.4024 1449.1712 1461.0305 1465.3263 1475.4300 1489.3133 1581.8846 1588.6450 1608.7635 1635.8971 2971.6758 3004.1736 3067.2527 3077.0302 3126.4595 3128.2853 3134.5923 3137.9727 3147.7708 3152.8682 3164.9562 3166.6729 3552.0936
redmass: 5.3615 4.9157 3.7941 3.3224 3.6442 4.3570 4.3126 3.1925 4.4092 2.3360 1.2860 5.1551 2.9115 2.8993 2.9544 5.3495 3.8008 3.5276 3.5435 4.6850 6.7264 5.0541 2.5032 1.5068 1.8769 3.7170 2.4708 3.0785 1.4295 1.5073 3.7012 1.8853 1.3827 1.4149 1.3154 1.3045 7.1106 3.2714 2.2174 1.9657 3.6110 2.0454 1.5080 1.6882 1.1031 1.1105 1.2016 1.6255 2.0789 1.4426 1.8495 1.3374 1.9400 2.2162 1.3847 1.2278 5.0564 3.7969 2.1726 2.6967 1.1849 1.2502 3.1180 3.9099 7.0742 6.6210 7.3568 7.6277 1.0668 1.0609 1.1007 1.0994 1.0849 1.0852 1.0891 1.0897 1.0951 1.0946 1.1002 1.1001 1.0663
irintensity: 1.4147 0.2084 1.4403 4.9367 0.3661 0.2135 0.8069 6.3148 1.5856 32.6309 186.5769 6.3956 0.9818 2.6877 10.3551 2.8349 6.3799 0.1002 1.7744 0.7205 4.0591 0.5427 41.8179 1.6011 122.1344 28.8473 0.7720 5.4664 0.0938 1.0790 21.2351 5.3946 2.7834 0.4382 0.0388 0.1091 7.5472 69.8023 2.9817 6.0719 3.6382 3.0298 5.5466 12.2695 9.8206 8.7887 22.8065 22.4280 6.2069 16.3126 0.1443 23.9098 32.5636 47.8256 8.4924 21.3760 0.1807 18.6911 43.1819 17.3181 29.4975 24.7671 45.8326 23.9996 0.5219 0.3350 34.8405 9.2786 39.7087 36.4346 14.3550 46.5781 0.9592 0.2800 6.5303 5.5787 28.2872 27.3346 42.7663 15.0273 4.7929
temp: 298.150 k
press: 1.00000 atm
elementType: 8 7 6 6 6 6 6 6 6 6 6 6 6 6 6 6 1 1 1 1 1 1 1 1 1 1 1 1 1
symmnumber: 1
zpe: 613612.8 jmol-1
zpe.correction: 0.233713 hartree
zpe.thermalcorrener: 0.246597 hartree
zpe.thermalcorrenthalpy: 0.247541 hartree
zpe.thermalcorrgfe: 0.194187 hartree
zpe.sumelectzpe: -670.155884 hartree
zpe.sumelectthermal: -670.143000 hartree
zpe.sumelectthermalent: -670.142056 hartree
zpe.sumelectthermalfe: -670.195410 hartree
dipole: -1.1009 0.5427 -0.7588
dipole: 1.4430
quadrupole: -90.2264 -85.4799 -98.7522
quadrupole: -6.2592 -3.4250 -8.0721
quadrupole: 1.2598 6.0063 -7.2660 -6.2592 -3.4250 -8.0721
hfenergy: -670.3895968 hartree
pointgroup: C01 [X(C14H13N1O1)]
dipole: 0.4510446 -0.1608324 -0.3049381 debye
polarizability: 238.9297184|-10.5322852|175.7771839|3.4189904|18.176339|78.0656804 unknown
InChI: InChI=1S/C14H13NO/c16-10-9-15-13-7-3-1-5-11(13)12-6-2-4-8-14(12)15/h1-8,16H,9-10H2
charge 0 multiplicity 1
29 atoms
O  -1.6813 -3.076619 1.160003
N  -0.074335 -1.011559 -0.453059
C  -1.087184 -0.044206 -0.264497
C  1.177558 -0.399714 -0.231779
C  -0.471116 1.213671 0.066635
C  0.968939 0.987289 0.088125
C  -0.282185 -2.420834 -0.804999
C  -2.489803 -0.183087 -0.368693
C  2.471619 -0.960412 -0.300423
C  -1.285395 2.34726 0.295291
C  2.085049 1.817636 0.342441
C  -0.436327 -3.336145 0.42966
C  -3.277925 0.96655 -0.141384
C  3.569278 -0.109629 -0.04509
C  -2.68646 2.218505 0.188029
C  3.38152 1.264479 0.274216
H  -1.19305 -2.499887 -1.425116
H  0.569778 -2.763408 -1.422125
H  -2.958622 -1.142654 -0.607534
H  2.63332 -2.016897 -0.539076
H  -0.835859 3.313234 0.551157
H  1.947242 2.876452 0.588399
H  -0.514789 -4.387096 0.102967
H  0.447986 -3.232891 1.092835
H  -4.368519 0.889419 -0.214782
H  4.58542 -0.517304 -0.090943
H  -3.329377 3.087974 0.361838
H  4.255147 1.895473 0.469552
H  -1.667208 -2.149201 1.510649
