program: Gaussian 09
title: 000228277
version: EM64L-G09RevD.01
frameworkgroup: C1[X(C15H28O3)]
method: RPBEPBE
basis: SDD
operation: Freq
keyword: #pfreq=noraman
keyword: PBEPBE/SDD
title: #p freq=noraman PBEPBE/SDD
converged: YES YES NO NO
title: Mulliken charges:
elementType: O O O C C C C C C C C C C C C C C C H H H H H H H H H H H H H H H H H H H H H H H H H H H H
charge: -0.290039 -0.275519 -0.207110 0.255610 0.284660 -0.526821 -0.750396 -0.734691 -0.386469 0.113413 -0.380532 -0.388866 -0.372621 -0.260001 -0.353822 -0.356453 -0.663928 -0.696327 0.223305 0.229133 0.238522 0.215803 0.229554 0.218045 0.254139 0.220224 0.206257 0.235919 0.195931 0.196020 0.194577 0.194782 0.190560 0.191150 0.188104 0.187742 0.235822 0.221697 0.195263 0.195120 0.219805 0.224022 0.253588 0.209465 0.215679 0.209681
chargesum: 0.00000
title: Mulliken charges with hydrogens summed into heavy atoms:
elementType: O O O C C C C C C C C C C C C C C C
charge: -0.290039 -0.275519 -0.207110 0.255610 0.284660 -0.074383 -0.066517 -0.042283 0.055708 0.113413 0.011419 0.000493 0.009089 0.197519 0.022024 0.033931 0.033487 -0.061502
polarizability: 1.97022286e+02 -5.34243115e+00 1.73125629e+02 -5.15789563e-01 -1.98656319e+00 1.47081276e+02
1716.lowfreq: -42.7638 -17.8060 -9.8727 -8.4444 -0.0005 -0.0002 0.0005 3.6020 15.5271
frequency: -39.9011 -17.4905 14.9712 35.8967 47.9446 59.8767 70.1897 81.8499 91.7123 103.8991 120.1659 126.4945 137.6392 142.8517 153.2346 175.7674 191.6822 207.7090 227.9439 229.7133 263.2853 286.9421 309.7641 319.8948 342.5580 369.4870 381.1696 412.7988 440.4389 459.3378 475.3936 514.5343 589.8731 670.2601 698.3771 717.8493 722.7480 730.4201 739.2597 775.8666 805.2842 814.5282 840.6697 867.2649 887.7965 894.2567 935.0650 942.1919 976.3754 988.5722 994.8603 1006.3847 1014.0060 1029.6737 1045.0913 1061.6072 1078.6915 1081.8392 1086.7186 1097.3050 1112.8973 1119.7378 1142.0319 1153.9449 1179.6635 1197.8520 1215.6041 1227.5076 1250.7102 1254.4016 1265.9593 1277.8120 1279.2840 1282.6569 1290.1163 1291.8907 1294.9381 1325.0617 1345.0252 1352.1551 1352.3763 1354.5478 1381.7543 1386.0934 1389.9228 1390.3603 1399.2394 1449.7431 1455.6121 1458.3002 1459.2485 1460.5377 1463.7070 1464.7705 1470.4620 1474.9304 1476.0309 1476.4018 1479.9693 1485.0490 1486.0287 1487.6657 1490.5536 1640.5316 2948.1461 2949.2222 2951.6683 2959.0200 2967.2072 2970.8373 2976.3096 2982.3519 2985.1538 2986.4703 2990.1219 2990.6748 2992.7077 3003.4633 3020.1039 3029.0427 3033.4567 3038.2889 3061.6413 3067.5060 3069.9476 3071.1678 3077.6150 3087.0517 3093.3144 3100.0356 3113.6872 3118.9459
redmass: 1.5749 4.6011 3.7649 3.8257 3.4355 2.4806 1.9295 3.1542 3.1773 3.0207 2.7063 1.7925 1.7134 2.0804 1.8554 2.2590 2.1543 1.2658 1.1056 1.6104 2.4535 3.0252 2.5987 4.0603 3.9639 2.8341 3.1411 3.4852 3.5475 3.3982 3.4007 4.3216 3.7128 5.5255 4.1335 1.0628 1.0959 3.6773 1.2441 1.3301 1.4488 2.3166 1.6961 2.6255 1.8937 2.5385 1.3341 1.4044 1.6429 3.3300 1.6341 1.5508 3.1282 2.1244 3.2419 2.7594 2.3797 2.1647 2.2962 2.2074 1.8505 2.5609 2.4602 1.6790 2.1518 1.9452 1.3502 1.7483 1.9440 1.3671 1.6853 1.1099 1.0458 1.1746 1.2028 1.1323 1.1963 1.4016 1.4958 1.3823 1.6837 1.4885 2.7664 1.2161 1.3726 1.2332 1.2224 1.0502 1.0919 1.0678 1.0705 1.0613 1.0486 1.0695 1.0787 1.1006 1.0969 1.0454 1.0777 1.0525 1.0769 1.0794 1.0919 10.6742 1.0585 1.0586 1.0591 1.0589 1.0585 1.0366 1.0650 1.0942 1.0367 1.0692 1.0386 1.0908 1.0361 1.1007 1.1029 1.0596 1.0996 1.1026 1.1017 1.1007 1.0993 1.0988 1.0984 1.0976 1.1029 1.0995 1.0976 1.1059
irintensity: 0.1069 0.7357 0.2322 0.8316 0.0639 0.7176 0.2597 0.5080 0.1240 0.1376 0.4463 0.0261 0.3982 0.6349 1.2177 0.7624 2.0237 0.1687 0.0015 0.4839 0.8339 0.8976 6.3217 0.5292 5.0506 2.1071 1.8456 5.3594 4.0219 4.7673 3.6855 10.4791 4.5712 9.4038 9.8633 15.2991 0.3028 6.1042 6.0611 2.1196 1.3227 2.5360 1.1685 3.2094 5.3057 14.5492 0.7579 0.9716 5.1033 0.8116 3.6388 3.1786 27.5983 98.6654 9.9247 3.2098 3.4517 3.4019 184.5563 17.9652 10.0737 24.9598 34.5054 12.9728 15.8813 24.6576 6.4902 4.6939 13.5805 0.9459 11.0236 1.6818 0.8192 4.2585 0.3086 1.7124 2.0319 1.0229 2.1223 0.3789 0.7461 1.3751 15.2405 11.1799 34.0795 22.6498 17.3703 2.2730 12.0976 1.0550 0.3185 0.8710 11.8580 2.2212 5.9746 4.9917 10.0665 9.9030 8.1683 12.5357 6.0252 15.5702 36.9569 166.9530 3.1968 0.1025 0.4763 47.3636 121.3606 35.5832 2.0370 1.4351 12.0046 45.0297 23.4391 16.2271 17.2720 3.7431 2.1388 29.9522 41.1608 64.6620 77.6473 101.0770 56.1331 2.6251 40.2350 36.0320 1.7811 16.9515 23.8057 29.0140
temp: 298.150 k
press: 1.00000 atm
elementType: 8 8 8 6 6 6 6 6 6 6 6 6 6 6 6 6 6 6 1 1 1 1 1 1 1 1 1 1 1 1 1 1 1 1 1 1 1 1 1 1 1 1 1 1 1 1
symmnumber: 1
zpe: 1054007.1 jmol-1
zpe.correction: 0.401450 hartree
zpe.thermalcorrener: 0.423088 hartree
zpe.thermalcorrenthalpy: 0.424032 hartree
zpe.thermalcorrgfe: 0.349026 hartree
zpe.sumelectzpe: -812.564269 hartree
zpe.sumelectthermal: -812.542632 hartree
zpe.sumelectthermalent: -812.541688 hartree
zpe.sumelectthermalfe: -812.616693 hartree
dipole: -2.7942 0.9070 3.0618
dipole: 4.2432
quadrupole: -129.6028 -101.9807 -114.8305
quadrupole: 2.9275 15.5213 -1.4793
quadrupole: -14.1315 13.4906 0.6409 2.9275 15.5213 -1.4793
hfenergy: -812.9657196 hartree
pointgroup: C01 [X(C15H28O3)]
dipole: 1.0514737 -0.5999238 1.1495227 debye
polarizability: 196.6208397|-6.3379479|172.0068757|0.9840106|6.2402042|148.6014765 unknown
InChI: InChI=1S/C15H28O3/c1-5-7-8-9-10-11-12-15(13(16)17-6-2)14(3,4)18-15/h5-12H2,1-4H3
charge 0 multiplicity 1
46 atoms
O  -3.268713 1.898065 -0.736418
O  -2.300098 -1.473929 0.444502
O  -3.921638 -0.926661 -1.143421
C  -2.333298 0.793342 -0.319704
C  -2.873696 1.749113 0.729982
C  -0.909857 0.888458 -0.880955
C  -2.019164 2.880943 1.279643
C  -4.014125 1.306303 1.636081
C  0.210683 0.410299 0.073513
C  -2.964008 -0.588939 -0.416908
C  1.608207 0.513739 -0.577497
C  2.747881 0.048276 0.356181
C  4.146133 0.141076 -0.295307
C  -2.769512 -2.897318 0.421797
C  5.289265 -0.323866 0.634785
C  6.685985 -0.234689 -0.02164
C  -2.102358 -3.67372 -0.71663
C  7.823678 -0.697133 0.91427
H  -0.862421 0.308531 -1.824585
H  -0.738997 1.943962 -1.163971
H  -1.204949 3.163421 0.594466
H  -1.579207 2.595067 2.252942
H  -2.651567 3.773058 1.44206
H  -3.619248 0.825837 2.550422
H  -4.681422 0.595605 1.121096
H  -4.618258 2.180502 1.939233
H  0.191733 1.017289 1.000818
H  0.015082 -0.63381 0.379685
H  1.796199 1.562612 -0.890094
H  1.625621 -0.093825 -1.50676
H  2.734773 0.65784 1.283992
H  2.558511 -0.999332 0.671083
H  4.15842 -0.468583 -1.223212
H  4.334516 1.188854 -0.610723
H  5.281781 0.287743 1.561504
H  5.101761 -1.37103 0.953027
H  -3.868923 -2.900317 0.318791
H  -2.477476 -3.278216 1.413434
H  6.871367 0.810992 -0.342187
H  6.693154 -0.848149 -0.945831
H  -2.394813 -4.738921 -0.662529
H  -1.00243 -3.614765 -0.644036
H  -2.419903 -3.280599 -1.696731
H  7.676888 -1.748398 1.226944
H  8.810232 -0.626375 0.420147
H  7.859414 -0.077752 1.830538
