program: Gaussian 09
title: 000228275
version: EM64L-G09RevD.01
frameworkgroup: C1[X(C14H16O)]
method: RPBEPBE
basis: SDD
operation: Freq
keyword: #pfreq=noraman
keyword: PBEPBE/SDD
title: #p freq=noraman PBEPBE/SDD
converged: NO YES NO NO
title: Mulliken charges:
elementType: O C C C C C C C C C C C C C C H H H H H H H H H H H H H H H H
charge: -0.437523 -0.565605 -0.377463 0.531655 -0.380568 -0.635360 0.374937 0.375240 -0.411520 -0.427191 -0.329962 -0.426711 -0.407384 -0.244426 -0.244697 0.211506 0.203848 0.214918 0.207686 0.184178 0.218784 0.242175 0.230869 0.233388 0.218049 0.183873 0.237757 0.236426 0.226998 0.227038 0.329086
chargesum: 0.00000
title: Mulliken charges with hydrogens summed into heavy atoms:
elementType: O C C C C C C C C C C C C C C
charge: -0.108437 -0.150251 0.045141 0.531655 0.022394 -0.393185 0.374937 0.375240 -0.180651 -0.193804 0.071960 -0.188954 -0.170958 -0.017428 -0.017659
polarizability: 2.38274649e+02 1.44585379e+01 1.48822001e+02 2.56596134e+01 -3.64329489e+00 9.04398591e+01
1716.lowfreq: -11.7426 -6.3285 -2.0121 0.0002 0.0005 0.0006 17.0194 43.0816 51.2179
frequency: 15.7229 43.0327 51.1888 89.6288 121.6719 136.1571 176.2592 182.1038 249.1606 276.4404 315.3778 347.6561 397.9065 404.3675 435.2806 478.3256 492.8113 513.6146 553.4203 622.2169 659.1004 724.9803 743.0232 758.7304 759.5090 787.5254 793.7443 831.8143 868.6674 877.7094 908.4336 919.5627 942.9349 956.0365 958.1673 975.9361 990.5262 1022.3380 1024.6824 1043.1249 1060.4478 1075.3404 1111.8258 1125.3417 1159.1012 1171.2235 1184.8378 1226.4159 1235.4102 1240.9183 1263.7836 1275.0490 1284.7142 1285.6886 1302.7812 1332.5826 1352.8991 1360.3692 1380.8754 1409.9103 1424.5194 1434.2958 1463.7541 1465.9337 1467.1271 1477.9111 1488.0825 1515.0602 1581.7148 1606.6398 1642.6708 2947.3905 2955.1963 2968.0773 2977.2117 3011.4089 3026.7479 3048.1275 3073.6694 3111.3378 3112.3852 3118.1497 3123.2154 3137.3203 3141.2689 3161.0768 3559.7397
redmass: 4.2452 4.3184 2.0277 2.7588 4.5568 2.0346 4.8424 3.7497 3.2123 3.9054 1.1617 3.2561 3.1585 3.2019 4.5262 2.5730 3.9320 6.5133 3.8021 6.2483 3.0175 3.4979 1.0893 1.7660 2.7021 2.6551 1.1888 1.3710 1.5654 2.8842 1.5526 1.6258 4.6636 3.6466 1.4036 1.3972 1.3441 2.5202 3.3818 3.6298 2.0007 1.7888 1.2314 1.7161 1.2584 1.0905 1.4193 1.4807 1.8788 1.3367 1.7542 1.7454 1.1952 1.1041 1.3206 1.3569 1.4568 1.6237 1.2558 5.2054 3.9534 2.9648 1.0792 1.2517 1.9354 1.1024 1.1017 3.6207 7.2586 5.6436 6.8410 1.0693 1.0636 1.0599 1.0613 1.0953 1.0979 1.1023 1.0979 1.0883 1.0893 1.0857 1.0889 1.0974 1.0947 1.1003 1.0661
irintensity: 0.6064 0.2206 3.5961 3.3388 2.7933 2.0464 0.3470 1.0548 0.3429 0.3321 146.3818 20.2411 1.3992 2.5235 7.0763 20.5655 3.8575 0.0172 2.6090 2.1048 2.8557 0.3035 7.3260 39.2656 16.9373 0.3962 1.7903 48.0614 22.8285 2.2279 11.5121 9.9488 29.8836 54.1188 2.7412 5.8624 0.0251 0.9007 24.6779 4.6950 2.9921 22.8144 25.4295 7.6043 2.8427 0.5554 2.8760 28.9596 0.8812 2.9329 0.9369 5.3366 5.9766 1.2785 3.0400 3.5624 3.1069 4.2191 29.4581 1.7219 0.3777 1.7690 0.1659 0.3477 0.7318 0.8561 16.3318 15.5261 0.2084 10.1328 10.3412 58.1550 24.6157 4.0842 82.5229 9.3935 2.8573 49.2192 57.7419 5.5698 17.5847 7.7666 0.4352 22.6455 40.2293 36.5218 8.1571
temp: 298.150 k
press: 1.00000 atm
elementType: 8 6 6 6 6 6 6 6 6 6 6 6 6 6 6 1 1 1 1 1 1 1 1 1 1 1 1 1 1 1 1
symmnumber: 1
zpe: 683835.9 jmol-1
zpe.correction: 0.260459 hartree
zpe.thermalcorrener: 0.274440 hartree
zpe.thermalcorrenthalpy: 0.275384 hartree
zpe.thermalcorrgfe: 0.217597 hartree
zpe.sumelectzpe: -617.222742 hartree
zpe.sumelectthermal: -617.208761 hartree
zpe.sumelectthermalent: -617.207817 hartree
zpe.sumelectthermalfe: -617.265604 hartree
dipole: -0.9411 1.4333 0.8127
dipole: 1.8975
quadrupole: -97.3690 -81.6246 -94.2134
quadrupole: 10.6791 10.3550 -1.6418
quadrupole: -6.3000 9.4444 -3.1444 10.6791 10.3550 -1.6418
hfenergy: -617.4832012 hartree
pointgroup: C01 [X(C14H16O1)]
dipole: -0.3755011 -0.6128969 -0.2016709 debye
polarizability: 238.1744028|-20.2713355|145.4141569|-21.2413021|-14.84691|93.9479494 unknown
InChI: InChI=1S/C14H16O/c15-10-4-3-5-12-8-9-13-6-1-2-7-14(13)11-12/h1-2,6-9,11,15H,3-5,10H2
charge 0 multiplicity 1
31 atoms
O  6.642844 0.46865 0.502405
C  1.843308 -0.20584 -1.036264
C  2.807279 -0.0261 0.169732
C  0.390187 -0.356305 -0.61391
C  4.283272 0.106837 -0.268852
C  -0.518152 0.703237 -0.722527
C  -1.881585 0.576295 -0.296118
C  -2.331032 -0.685459 0.2579
C  -0.070048 -1.602083 -0.062041
C  -1.389533 -1.762916 0.359559
C  5.241555 0.28818 0.921465
C  -2.819147 1.656674 -0.4042
C  -3.69515 -0.816665 0.679508
C  -4.142572 1.500918 0.015775
C  -4.585357 0.253754 0.56224
H  1.952682 0.664473 -1.711946
H  2.164223 -1.098352 -1.611326
H  2.503642 0.872196 0.743428
H  2.694741 -0.887717 0.858917
H  4.577746 -0.797005 -0.845231
H  4.399626 0.971378 -0.951524
H  -0.18677 1.660665 -1.145786
H  0.634636 -2.439489 0.016913
H  -1.725178 -2.722446 0.771654
H  5.005136 1.213784 1.473511
H  5.148105 -0.568212 1.625151
H  -2.481337 2.612275 -0.823446
H  -4.03149 -1.773465 1.097238
H  -4.849002 2.3338 -0.071765
H  -5.62581 0.1440 0.887341
H  6.925882 -0.329863 -0.011104
