program: Gaussian 09
title: 000228273
version: EM64L-G09RevD.01
frameworkgroup: C1[X(C15H14)]
method: RPBEPBE
basis: SDD
operation: Freq
keyword: #p
keyword: freq=noraman
keyword: PBEPBE/SDD
title: #p freq=noraman PBEPBE/SDD
converged: YES YES NO NO
title: Mulliken charges:
elementType: C C C C C C C C C C C C C C C H H H H H H H H H H H H H H
charge: -0.017979 0.295041 0.323386 -0.596636 0.226777 -0.423039 -0.481836 0.440519 -0.436123 -0.492711 -0.370477 -0.715139 -0.455898 -0.278329 -0.246431 0.237467 0.237468 0.248285 0.221019 0.221020 0.239752 0.236103 0.244796 0.219498 0.217763 0.217762 0.237746 0.224005 0.226194
chargesum: 0.00000
title: Mulliken charges with hydrogens summed into heavy atoms:
elementType: C C C C C C C C C C C C C C C
charge: -0.017979 0.295041 0.323386 -0.121701 0.226777 -0.174754 -0.039797 0.440519 -0.196371 -0.256608 -0.125682 -0.060116 -0.218152 -0.054324 -0.020237
polarizability: 2.27381581e+02 2.03459884e+01 1.92703239e+02 2.79441841e-03 7.38180890e-03 7.55047130e+01
1716.lowfreq: -8.4249 -0.0008 -0.0003 0.0006 6.3420 6.7954 56.8798 108.4093 150.0093
frequency: 56.8740 108.4090 150.0084 157.1091 200.3347 238.0869 263.8271 266.7668 290.5202 318.7399 405.8760 419.5361 471.4830 501.9770 504.9416 515.8580 578.8777 592.8655 643.8055 673.7128 683.8833 742.1241 748.6358 756.9889 793.1938 819.8964 829.2318 838.0725 882.8266 925.7847 938.3770 955.9120 966.7813 971.1126 988.7770 992.7367 1021.7359 1033.1439 1073.4792 1087.1841 1103.8057 1125.4090 1150.9570 1174.3920 1189.7567 1198.6245 1233.5197 1250.7411 1264.7031 1281.2093 1289.1917 1346.0197 1380.3023 1390.8419 1393.8304 1410.2748 1419.6049 1432.8595 1451.5208 1465.5888 1479.6675 1487.2177 1528.2585 1563.1376 1594.2628 1608.8684 1629.1319 2959.4440 2972.7285 2979.9797 3002.7463 3013.7826 3075.4764 3078.9932 3117.0504 3119.1633 3131.6214 3142.9562 3154.2232 3184.9689 3189.6480
redmass: 3.3851 3.2870 2.6836 3.5783 2.1050 2.2891 3.6778 2.2628 1.4971 4.0512 2.8286 5.7850 2.5862 3.2369 4.8211 4.8674 2.9013 4.4481 4.9651 4.8773 3.3539 5.6523 1.2867 1.2491 1.9128 1.3165 1.4216 4.6092 1.8433 1.9557 3.9355 1.4084 3.2880 1.4253 1.3459 1.8418 2.4227 2.1927 2.0365 1.5762 1.1449 2.1741 1.3056 1.1478 1.8388 1.7120 1.9640 1.6764 1.1506 2.1777 1.9597 2.0079 2.8756 1.2868 3.4335 1.5148 2.3421 3.1461 1.8748 1.2197 1.0422 1.0542 4.4158 6.3342 6.8688 6.4714 6.7209 1.0597 1.0611 1.0357 1.0990 1.0976 1.1002 1.0995 1.0864 1.0863 1.0904 1.0977 1.0979 1.0952 1.0930
irintensity: 0.0155 1.2546 0.0126 0.1522 7.1972 0.0046 1.4289 0.3117 8.9376 2.9806 1.4355 0.2735 5.0829 1.0706 0.5254 0.6099 6.3730 2.1935 1.2819 1.1587 9.3096 1.3408 25.5730 18.8190 11.2062 88.4565 0.7710 4.6467 14.2888 0.0516 18.1478 1.0777 7.5314 0.8600 0.6404 6.6293 1.9570 7.3866 4.1457 0.0139 1.6166 0.8526 0.3713 2.6740 6.1065 2.2413 2.7279 14.1906 0.0479 5.6910 2.6911 5.6953 22.3576 18.3475 2.7833 11.9929 3.8141 0.1214 6.8816 2.0532 12.6986 10.1448 6.5577 3.4753 0.0671 3.3019 2.0550 25.1927 18.3876 33.5811 11.2859 9.0854 42.8837 37.1566 1.9498 3.0362 15.9230 33.5065 39.5202 8.2725 15.3240
temp: 298.150 k
press: 1.00000 atm
elementType: 6 6 6 6 6 6 6 6 6 6 6 6 6 6 6 1 1 1 1 1 1 1 1 1 1 1 1 1 1
symmnumber: 1
zpe: 630288.2 jmol-1
zpe.correction: 0.240064 hartree
zpe.thermalcorrener: 0.252076 hartree
zpe.thermalcorrenthalpy: 0.253020 hartree
zpe.thermalcorrgfe: 0.202333 hartree
zpe.sumelectzpe: -578.960678 hartree
zpe.sumelectthermal: -578.948666 hartree
zpe.sumelectthermalent: -578.947722 hartree
zpe.sumelectthermalfe: -578.998409 hartree
dipole: 0.8919 0.1698 0.0000
dipole: 0.9079
quadrupole: -78.7425 -77.2462 -94.1846
quadrupole: 0.6124 0.0001 0.0011
quadrupole: 4.6486 6.1449 -10.7935 0.6124 0.0001 0.0011
hfenergy: -579.2007422 hartree
pointgroup: C01 [X(C15H14)]
dipole: -0.3545142 0.0436654 -0.0000036 debye
polarizability: 229.8951727|-17.9017849|190.1896467|0.0032725|-0.0071827|75.504713 unknown
InChI: InChI=1S/C15H14/c1-2-11-7-9-13-10-8-12-5-3-4-6-14(12)15(11)13/h3-8,10H,2,9H2,1H3
charge 0 multiplicity 1
29 atoms
C  -0.607187 0.258855 -0.000237
C  -0.801328 1.663078 -0.000321
C  -1.952005 -0.393251 -0.000223
C  -2.285176 1.970672 -0.00036
C  0.732261 -0.282291 -0.000185
C  -2.912509 0.592969 -0.000299
C  -2.225483 -1.885353 -0.000142
C  1.840632 0.663962 -0.000232
C  0.283847 2.575607 -0.000365
C  1.590254 2.077302 -0.000323
C  1.05025 -1.684044 -0.000087
C  -3.720474 -2.262862 -0.000179
C  3.188538 0.170661 -0.000185
C  2.374202 -2.131307 -0.000044
C  3.45742 -1.198175 -0.000094
H  -2.586084 2.564796 0.887037
H  -2.586067 2.564732 -0.887802
H  -3.992375 0.429033 -0.000313
H  -1.738162 -2.343641 -0.88522
H  -1.738232 -2.343535 0.885029
H  0.097176 3.655807 -0.000432
H  2.447504 2.761003 -0.000361
H  0.245293 -2.421116 -0.000048
H  -3.841397 -3.361145 -0.000123
H  -4.234757 -1.864706 -0.8943
H  -4.234825 -1.864609 0.893859
H  4.010316 0.897347 -0.000221
H  2.586629 -3.206478 0.000029
H  4.490741 -1.56241 -0.000061
