program: Gaussian 09
title: 000228270
version: EM64L-G09RevD.01
frameworkgroup: C1[X(C12H11Br)]
method: RPBEPBE
basis: SDD
operation: Freq
keyword: #p
keyword: freq=noraman
keyword: PBEPBE/SDD
title: #p freq=noraman PBEPBE/SDD
converged: YES YES NO NO
title: Mulliken charges:
elementType: Br C C C C C C C C C C C C H H H H H H H H H H H
charge: -0.042838 0.486707 0.373653 0.377613 -0.511894 -0.603300 -0.399987 -0.417309 -0.420245 -0.404671 -0.671492 -0.241476 -0.240892 0.240308 0.240526 0.244141 0.235650 0.237132 0.239568 0.238643 0.290560 0.290584 0.229572 0.229445
chargesum: 0.00000
title: Mulliken charges with hydrogens summed into heavy atoms:
elementType: Br C C C C C C C C C C C C
charge: -0.042838 0.486707 0.373653 0.377613 -0.031061 -0.359159 -0.164337 -0.180176 -0.180676 -0.166028 -0.090348 -0.011904 -0.011447
polarizability: 2.52532197e+02 -1.09365910e+01 1.33268443e+02 -1.91966798e+01 -4.04103683e+00 6.93827194e+01
1716.lowfreq: -9.5555 -0.0004 -0.0003 0.0002 1.9424 8.0927 31.4646 52.2875 74.9641
frequency: 30.6035 52.2507 74.8867 149.7181 169.8440 181.4174 261.8486 312.4042 397.1655 403.3444 466.3483 479.3411 513.5497 517.7964 595.8617 622.6454 664.7040 727.9156 758.7422 761.1569 769.5847 787.5631 834.4738 871.6015 880.9441 917.5876 945.8247 960.0470 967.6305 978.1503 992.7529 1023.0092 1036.0553 1106.7426 1125.7951 1160.1921 1172.4041 1181.2006 1226.6911 1235.4975 1257.6644 1272.8316 1275.6896 1310.0119 1359.9588 1409.6857 1425.1903 1434.3523 1451.4804 1465.6888 1477.2102 1514.6428 1581.5844 1605.2576 1641.3193 3011.6073 3056.0957 3072.5290 3112.2073 3114.6658 3120.0551 3125.0306 3139.6829 3142.8870 3143.5859 3162.3324
redmass: 4.9613 5.6180 2.3833 6.5419 6.6419 3.6348 2.9569 4.3377 3.1556 3.2761 5.4795 2.5324 6.5951 3.9161 4.9260 5.8486 3.3440 3.0638 3.7829 1.4707 1.1998 2.6915 1.3594 1.6400 3.2551 1.6756 3.1077 1.3689 1.6079 1.3942 1.3479 2.2708 4.4579 1.1825 1.7289 1.2685 1.1039 1.4071 1.1594 2.2669 1.5215 1.3416 1.7863 1.3742 1.6458 5.2116 4.0076 2.9791 1.0934 2.5412 1.0974 3.6184 7.2503 5.5989 6.8185 1.0601 1.0564 1.1033 1.0912 1.0870 1.0859 1.0890 1.0976 1.0954 1.1108 1.1004
irintensity: 0.1216 0.1731 1.4834 1.1379 5.4760 0.6377 0.9996 1.5648 0.8600 2.6853 12.1160 23.0364 0.2854 6.4894 38.2837 7.4969 17.2758 3.8800 3.7104 62.9334 4.9673 1.7748 41.9741 20.4678 4.3079 7.9871 3.6514 2.7678 2.9634 5.3300 0.0320 5.5175 11.1653 2.0297 7.3746 3.7068 0.3067 2.9294 29.2215 1.8610 0.3492 1.4052 7.3844 23.2040 5.0536 2.0458 0.0843 1.2466 3.6052 0.1540 10.3090 12.8014 0.2444 6.0958 1.8792 16.2062 16.0428 7.0705 9.1648 8.4551 6.2328 0.2274 13.8876 29.7626 19.1424 35.4471
temp: 298.150 k
press: 1.00000 atm
elementType: 35 6 6 6 6 6 6 6 6 6 6 6 6 1 1 1 1 1 1 1 1 1 1 1
symmnumber: 1
zpe: 502422.8 jmol-1
zpe.correction: 0.191363 hartree
zpe.thermalcorrener: 0.202582 hartree
zpe.thermalcorrenthalpy: 0.203527 hartree
zpe.thermalcorrgfe: 0.151736 hartree
zpe.sumelectzpe: -476.439309 hartree
zpe.sumelectthermal: -476.428090 hartree
zpe.sumelectthermalent: -476.427145 hartree
zpe.sumelectthermalfe: -476.478935 hartree
dipole: 2.8342 0.3149 -0.1533
dipole: 2.8558
quadrupole: -90.3618 -76.9934 -90.3941
quadrupole: -1.2895 -3.0883 -1.3630
quadrupole: -4.4454 8.9230 -4.4777 -1.2895 -3.0883 -1.3630
hfenergy: -476.6306719 hartree
pointgroup: C01 [X(C12H11Br1)]
dipole: 1.1094163 0.1767028 -0.0180538 debye
dipolederiv: -0.8819356 -0.0820891 -0.0836754 -0.1247237 -0.161305 -0.0137992 -0.0146892 0.0007484 -0.1778429 0.2270422 0.0759546 -0.0370434 0.1238315 0.0142815 -0.0065914 -0.2178109 -0.0463901 -0.1036264 0.1076481 -0.067565 -0.0022041 -0.0597036 -0.0881982 0.0311745 0.027564 0.0312839 0.0555858 0.058068 -0.0575403 0.0002168 -0.0565176 -0.1185089 0.0266949 -0.0023572 0.0306122 0.0301162 -0.2329505 -0.0567348 -0.0856413 -0.0429775 0.1091681 -0.017508 0.0317459 0.0229793 0.0943948 -0.1032513 0.0234125 -0.0236642 -0.0028858 0.0543372 -0.0602303 -0.0590167 -0.0411044 -0.1690243 -0.1627503 -0.0853931 -0.0100056 -0.032039 0.0660335 -0.0112125 -0.0323919 -0.0161603 -0.1629358 -0.0305684 0.0334706 -0.0296351 -0.014206 0.1310106 -0.0323727 -0.0063153 -0.0395213 -0.1451283 -0.0830328 0.0479609 -0.0250013 -0.0252323 0.1081775 -0.0423375 -0.0040414 -0.0448805 -0.163072 -0.0203903 0.0350701 -0.0274791 0.1181133 0.0926159 -0.0473174 -0.0418098 -0.0410098 -0.1603142 1.172579 0.1439045 0.0467842 0.1724288 0.1305661 0.0084602 0.1310998 0.0057008 0.1047205 -0.0471214 -0.0963386 -0.0076203 -0.0836489 0.0867776 -0.0236112 -0.0087715 -0.0192443 -0.1576575 0.0472199 0.0900073 -0.0502659 0.0736009 -0.0447476 -0.0258554 -0.0408088 -0.0296961 -0.1495422 -0.0040755 0.0337835 0.0571732 0.0626574 -0.0213601 -0.09375 0.0308301 -0.0602787 0.0148102 0.0370445 0.0097364 0.0082953 -0.0514143 -0.0561088 0.1058878 -0.0015865 0.0592401 0.0210081 0.0579052 -0.0346258 0.0236539 -0.0827361 -0.0726554 0.040913 0.0219472 0.0349907 0.1306951 -0.0216356 0.1210151 0.0166657 0.1098834 -0.0051138 0.006263 0.0190592 0.0026271 0.1395685 0.0412701 -0.0841273 0.0234696 -0.0336589 -0.0843404 0.0315391 0.0259975 0.0416657 0.1443033 0.0640392 -0.0861402 0.0274196 -0.0141539 -0.0822217 0.0359561 0.016532 0.0458712 0.1463261 0.0602635 -0.0127946 0.0155668 -0.0888832 -0.0914083 0.0444281 0.0271146 0.0354813 0.1475362 -0.0479341 -0.0756026 0.0372307 -0.0241144 -0.0273746 0.095573 0.0161556 0.0517514 0.0280616 -0.0776088 0.0509649 0.0675183 -0.0067631 0.0066698 -0.0777335 0.0198195 -0.0495776 0.0214697 -0.0273596 0.1126312 0.0105386 0.1221956 -0.0291193 0.008879 0.0113929 0.0082682 0.1584087 -0.1324654 -0.0389602 0.0477028 -0.0390527 0.0828244 0.0165504 0.0503407 0.0166427 0.1521389 unknown
polarizability: 254.5871599|-5.2761571|132.1513317|-10.93806|-6.9856566|68.4448675 unknown
InChI: InChI=1S/C12H11Br/c13-8-7-10-5-6-11-3-1-2-4-12(11)9-10/h1-6,9H,7-8H2
charge 0 multiplicity 1
24 atoms
Br -5.542495 -0.561817 -0.466761
C  -1.353829 0.173817 0.426697
C  0.984023 -0.59289 0.172725
C  1.409296 0.77028 -0.076727
C  -2.834189 -0.116322 0.648887
C  -0.403637 -0.854659 0.419568
C  -0.919529 1.521827 0.179257
C  0.422788 1.811534 -0.064153
C  1.967134 -1.637632 0.1667
C  2.797018 1.03449 -0.322631
C  -3.549381 -0.215209 -0.710678
C  3.312356 -1.350869 -0.077078
C  3.731405 -0.003927 -0.323836
H  -3.30396 0.68637 1.245674
H  -2.970359 -1.063108 1.200334
H  -0.718467 -1.888933 0.612022
H  -1.661167 2.330426 0.195585
H  0.740812 2.845386 -0.244816
H  1.64673 -2.66918 0.356791
H  3.115126 2.067168 -0.510211
H  -3.494254 0.721008 -1.286644
H  -3.185936 -1.058832 -1.316571
H  4.055282 -2.156001 -0.080332
H  4.789831 0.206375 -0.512902
