program: Gaussian 09
title: 000228255
version: EM64L-G09RevD.01
frameworkgroup: C1[X(C21H16O2)]
method: RPBEPBE
basis: SDD
operation: Freq
keyword: #pfreq=noraman
keyword: PBEPBE/SDD
title: #p freq=noraman PBEPBE/SDD
converged: YES YES NO NO
title: Mulliken charges:
elementType: O O C C C C C C C C C C C C C C C C C C C C C H H H H H H H H H H H H H H H H
charge: -0.399546 -0.266472 -0.035823 -0.133353 0.186915 0.257136 0.146885 0.267941 0.308797 -0.423682 -0.432882 -0.398398 -0.417348 0.157143 -0.383721 -0.220830 -0.223498 -0.219356 -0.227750 -0.366671 -0.266678 -0.242446 -0.537432 0.353916 0.255692 0.247431 0.252546 0.251282 0.248011 0.223981 0.220026 0.225538 0.220783 0.235885 0.224729 0.224010 0.221078 0.215336 0.250826
chargesum: 0.00000
title: Mulliken charges with hydrogens summed into heavy atoms:
elementType: O O C C C C C C C C C C C C C C C C C C C C C
charge: -0.045631 -0.266472 -0.035823 -0.133353 0.186915 0.257136 0.146885 0.267941 0.308797 -0.167991 -0.185452 -0.145852 -0.166065 0.157143 -0.135710 0.003152 -0.003472 0.006182 -0.006967 -0.130786 -0.041949 -0.018437 0.149808
polarizability: 2.47099251e+02 -2.36090043e+00 2.60729685e+02 1.21881960e+01 1.37403361e+01 1.73862481e+02
1716.lowfreq: -6.0259 -0.0004 -0.0003 0.0007 3.8083 5.3840 31.3675 52.6173 58.2461
frequency: 31.2126 52.5957 58.2344 68.0560 102.1224 114.5809 140.3062 152.9574 159.8676 183.2088 185.1512 231.3719 264.7819 283.7510 298.3693 304.5710 333.9352 358.6669 400.1029 408.2572 432.2866 445.2471 474.9467 498.6161 500.7961 538.4900 548.0187 567.3029 609.3272 620.7573 637.0934 678.2642 689.8421 702.8180 732.7301 741.0582 753.7491 755.4396 756.3715 771.2765 780.3008 801.2766 853.3480 865.4542 875.0601 882.7758 925.2712 930.3733 938.0808 941.1482 949.1227 973.3206 982.3207 985.3703 986.7416 999.4965 1002.1728 1032.5158 1047.7013 1073.3334 1088.5495 1111.8312 1117.2280 1127.1485 1139.2040 1152.5104 1156.8593 1167.2348 1174.7282 1188.8662 1209.5182 1227.7381 1258.0385 1267.0156 1270.4619 1294.5534 1318.5095 1378.5791 1397.9385 1404.7922 1424.7899 1432.5528 1438.3993 1442.1746 1443.9193 1451.2113 1467.0431 1469.9652 1487.9869 1585.2078 1595.6087 1601.0490 1605.9955 1612.6950 1622.3825 2958.0554 3046.3069 3119.7857 3121.9562 3127.1801 3128.6853 3134.2839 3136.0396 3144.0774 3146.4938 3149.8751 3158.9970 3159.8049 3160.9998 3169.8077 3550.7210
redmass: 4.4096 4.5434 4.9977 4.9077 3.2946 3.9832 3.9482 4.1443 4.5333 4.4640 4.6094 1.4423 3.9615 2.8356 5.3910 3.8332 4.0296 1.3312 3.0237 4.1827 4.3340 3.6761 5.1651 4.4287 4.3701 4.3656 4.2687 4.7245 5.8635 5.9575 6.0559 5.6115 4.9339 5.6273 5.1771 3.8603 1.3794 1.4239 3.2922 1.8445 3.2664 3.8823 1.5960 3.9498 1.3430 1.4021 3.8960 3.5473 1.5408 1.5046 1.7081 1.3177 1.3083 1.3699 6.7733 2.3017 2.1823 5.3834 2.2758 2.6472 3.3167 1.2583 1.5450 1.6057 1.6642 1.4846 1.4044 1.2732 1.0757 1.6994 3.0140 3.4223 1.5201 1.5840 1.8178 2.2638 2.1516 9.7986 6.1486 4.3157 1.6112 2.3906 2.1977 2.3322 1.6210 3.0833 1.1240 1.0896 2.1551 6.8219 7.2460 6.4144 7.5472 7.6036 7.6946 1.0330 1.1038 1.0851 1.0852 1.0973 1.0868 1.0899 1.0902 1.0899 1.0952 1.0957 1.0939 1.0995 1.0995 1.0989 1.0655
irintensity: 0.4702 1.3126 0.5701 1.0050 3.8369 0.4357 1.1880 2.1511 1.8398 2.8510 2.0600 0.2680 3.2641 1.6930 4.3118 3.3182 1.9555 134.2634 1.1616 20.8103 6.3328 8.2342 1.1390 4.3966 2.6288 23.8984 6.1023 2.2504 26.0618 20.0708 1.6296 1.1462 0.5214 18.9566 4.6128 56.7525 43.8946 63.5627 11.4804 50.8004 16.4461 1.1068 0.9024 15.2961 0.2675 0.4145 5.8542 10.5004 3.9400 0.2271 0.7699 0.0865 0.0050 1.7793 34.7943 4.3010 6.0346 18.4975 21.5834 14.7899 26.7482 0.0456 13.5722 33.4607 7.2363 7.2978 1.9196 29.6229 7.5482 25.0531 76.2013 122.0912 6.9455 2.3030 14.4002 2.1006 7.7973 8.8346 7.9092 6.2283 16.2437 34.8798 5.6303 6.1935 13.5522 8.3803 52.7250 26.1563 43.6578 13.1507 3.6782 17.3353 1.2984 3.8219 10.2754 72.7722 38.7922 1.7125 0.4887 15.0080 1.2666 10.2725 14.6469 17.1936 17.4262 28.0181 11.4035 55.2875 28.8744 21.6257 8.6861
temp: 298.150 k
press: 1.00000 atm
elementType: 8 8 6 6 6 6 6 6 6 6 6 6 6 6 6 6 6 6 6 6 6 6 6 1 1 1 1 1 1 1 1 1 1 1 1 1 1 1 1
symmnumber: 1
zpe: 795259.9 jmol-1
zpe.correction: 0.302898 hartree
zpe.thermalcorrener: 0.321709 hartree
zpe.thermalcorrenthalpy: 0.322653 hartree
zpe.thermalcorrgfe: 0.256074 hartree
zpe.sumelectzpe: -958.616127 hartree
zpe.sumelectthermal: -958.597317 hartree
zpe.sumelectthermalent: -958.596372 hartree
zpe.sumelectthermalfe: -958.662951 hartree
dipole: -1.0388 -0.6031 -0.0410
dipole: 1.2019
quadrupole: -115.0831 -121.1985 -128.7945
quadrupole: -6.2232 0.4091 -0.1267
quadrupole: 6.6089 0.4935 -7.1025 -6.2232 0.4091 -0.1267
hfenergy: -958.9190252 hartree
pointgroup: C01 [X(C21H16O2)]
dipole: -0.419671 0.2164098 0.0254232 debye
polarizability: 247.1031081|2.3044525|259.107897|-12.1389423|18.1171765|175.4804115 unknown
InChI: InChI=1S/C21H16O2/c1-23-19-13-7-6-12-18(19)20-14-8-2-4-10-16(14)21(20,22)17-11-5-3-9-15(17)20/h2-13,22H,1H3
charge 0 multiplicity 1
39 atoms
O  0.271889 -0.168971 -2.557601
O  -2.291319 -1.163448 -0.519846
C  0.030191 0.260772 0.200633
C  0.806693 -0.207499 -1.238194
C  1.291188 1.137689 0.411288
C  0.285216 -1.212374 0.619354
C  1.916428 0.779282 -0.808685
C  0.907699 -1.595127 -0.592198
C  -1.327845 0.895981 0.23414
C  1.91883 1.978926 1.340791
C  0.148636 -2.095693 1.695731
C  3.179005 1.260917 -1.182326
C  1.405755 -2.883173 -0.812509
C  -2.501633 0.168192 -0.148859
C  -1.494809 2.255029 0.599151
C  3.197418 2.487934 0.971939
C  0.645082 -3.415454 1.489046
C  3.809338 2.145406 -0.261061
C  1.252441 -3.801508 0.266349
C  -3.775343 0.785219 -0.146812
C  -2.761962 2.881756 0.600581
C  -3.903093 2.141743 0.2295
C  -3.437292 -1.950964 -0.972931
H  0.177565 0.774541 -2.84622
H  1.467402 2.24593 2.302475
H  -0.331666 -1.814838 2.638891
H  3.665261 0.984303 -2.123879
H  1.87235 -3.187482 -1.754904
H  -0.608879 2.833102 0.880251
H  3.725608 3.162241 1.656299
H  0.553649 -4.156885 2.291926
H  4.793141 2.565296 -0.501028
H  1.613325 -4.830824 0.154881
H  -4.666307 0.221873 -0.439755
H  -2.853041 3.93388 0.89008
H  -4.892778 2.612227 0.226774
H  -3.899135 -1.504393 -1.874897
H  -4.199233 -2.054017 -0.175422
H  -3.020272 -2.938185 -1.219155
