program: Gaussian 09
title: 000228253
version: EM64L-G09RevD.01
frameworkgroup: C1[X(C20H16O2)]
method: RPBEPBE
basis: SDD
operation: Freq
keyword: #pfreq=noraman
keyword: PBEPBE/SDD
title: #p freq=noraman PBEPBE/SDD
converged: YES YES NO NO
title: Mulliken charges:
elementType: O O C C C C C C C C C C C C C C C C C C C C H H H H H H H H H H H H H H H H
charge: -0.271671 -0.450360 -0.100299 0.285783 0.286172 0.308802 0.090016 0.089521 0.287101 -0.343279 -0.343105 -0.402047 -0.364871 -0.364700 -0.426790 -0.257927 -0.257929 -0.865815 -0.244342 -0.222364 -0.222384 -0.243315 0.263060 0.263023 0.304390 0.347237 0.259632 0.259648 0.228650 0.230665 0.230630 0.251997 0.252089 0.226591 0.226587 0.232344 0.232346 0.224912
chargesum: 0.00000
title: Mulliken charges with hydrogens summed into heavy atoms:
elementType: O O C C C C C C C C C C C C C C C C C C C C
charge: -0.271671 -0.103123 -0.100299 0.285783 0.286172 0.308802 0.090016 0.089521 0.287101 -0.080219 -0.080082 -0.097657 -0.105239 -0.105052 -0.198140 -0.027262 -0.027298 -0.135138 -0.017755 0.009981 0.009962 -0.018404
polarizability: 2.49016320e+02 1.03423561e-01 2.44341822e+02 -2.35067163e+01 6.04028592e-02 1.52960274e+02
1716.lowfreq: -8.2150 -4.4735 -0.0006 0.0005 0.0006 8.1894 32.7818 36.8260 58.9771
frequency: 32.6346 36.7808 58.9758 82.3041 118.5582 133.7827 180.9488 181.5930 209.1974 220.4139 272.7026 281.4724 293.4565 295.4538 327.8166 328.5426 361.7268 383.9104 410.6982 449.4592 453.8483 477.1332 513.6933 514.1210 533.6441 549.3095 578.2390 582.6457 615.2494 625.0904 644.6244 672.6817 728.8088 732.6900 737.4947 763.1786 765.7111 771.6733 772.2592 796.0813 855.8309 864.6255 869.2924 883.3271 893.0585 918.4127 926.9077 958.0014 960.1736 967.0934 986.2383 986.7366 992.6090 999.2352 1030.0902 1035.2984 1043.6268 1052.5821 1091.6605 1100.7577 1109.2655 1155.0181 1164.4318 1167.4346 1171.5309 1175.5482 1194.1313 1209.1880 1211.3771 1229.6452 1271.6839 1281.5363 1287.3641 1311.2472 1368.0780 1383.5453 1393.2350 1400.9576 1431.7765 1433.2459 1447.8488 1466.3983 1473.0075 1474.3718 1475.8693 1487.9804 1575.4417 1583.2041 1597.7312 1609.0367 1610.8884 1628.1924 2983.8450 3063.7888 3082.6522 3117.5027 3132.4625 3135.7900 3135.8939 3146.7765 3146.9392 3154.2496 3161.4914 3161.7852 3173.7721 3174.1290 3183.3132 3551.4177
redmass: 3.4738 5.1543 4.8455 4.8375 3.7617 1.6677 5.3681 1.9934 4.5692 2.8064 5.3668 3.3754 1.5403 5.4360 2.4197 4.6962 4.6140 4.5669 5.2319 3.1288 3.5823 3.2759 3.9040 3.9440 5.5753 3.9550 5.1101 6.3937 5.9004 6.1844 6.4944 6.3544 3.8669 4.8320 2.9764 2.2331 1.3283 1.3096 1.9232 5.3283 5.4469 1.4971 1.4089 1.3658 3.3573 4.7687 7.3562 1.3727 1.4190 1.4502 1.3153 1.3194 1.5827 1.3282 2.2866 1.9088 1.5929 2.2342 2.1849 2.5087 2.1087 1.7002 1.5712 1.0822 1.3415 1.0847 2.3921 2.3547 1.8668 4.1427 1.6240 1.4661 1.9068 1.6956 7.7852 11.1021 9.9748 1.2393 2.1460 2.4373 2.5415 1.8996 1.2209 2.4130 2.4646 1.1732 6.8978 6.4753 7.5602 6.7809 6.2269 7.2514 1.0366 1.0967 1.0989 1.0862 1.0902 1.0855 1.0855 1.0902 1.0903 1.0980 1.0949 1.0950 1.1001 1.1001 1.0939 1.0661
irintensity: 0.0035 0.8484 0.0509 1.0495 0.0001 0.3144 0.3314 0.4137 0.9076 1.5141 1.2012 5.2453 65.4323 0.5701 62.2473 7.0338 0.5876 0.3301 0.3412 3.0563 6.2341 0.0350 10.6883 0.7244 3.6900 1.5981 2.3506 2.1611 14.0178 10.6782 6.4735 0.2761 4.4756 1.9072 6.3455 114.9373 54.8730 4.5377 82.5253 9.4149 25.0599 2.3481 0.0196 5.3569 46.7455 10.4865 43.9687 0.1517 0.7164 0.4694 0.0975 0.4339 3.1059 0.5817 0.7502 20.0639 2.3046 12.7406 33.1940 4.3070 17.2580 24.4686 15.0268 0.4220 0.8848 1.6049 5.3708 1.1615 64.1367 159.0891 5.9409 5.4790 92.6920 41.0522 0.2328 23.3498 0.0184 9.6674 4.7621 146.5700 22.7802 85.3132 12.2030 26.4211 0.2232 31.9984 29.1901 0.6991 12.3257 32.1798 1.4244 1.0074 22.2142 10.4442 23.2494 4.5535 22.3867 0.3449 2.1410 11.2274 6.1164 38.0883 16.2638 13.0100 31.3062 5.2091 7.2084 9.8989
temp: 298.150 k
press: 1.00000 atm
elementType: 8 8 6 6 6 6 6 6 6 6 6 6 6 6 6 6 6 6 6 6 6 6 1 1 1 1 1 1 1 1 1 1 1 1 1 1 1 1
symmnumber: 1
zpe: 784691.5 jmol-1
zpe.correction: 0.298873 hartree
zpe.thermalcorrener: 0.316556 hartree
zpe.thermalcorrenthalpy: 0.317500 hartree
zpe.thermalcorrgfe: 0.253553 hartree
zpe.sumelectzpe: -920.663837 hartree
zpe.sumelectthermal: -920.646155 hartree
zpe.sumelectthermalent: -920.645210 hartree
zpe.sumelectthermalfe: -920.709157 hartree
dipole: -0.7653 -0.0002 0.5516
dipole: 0.9433
quadrupole: -119.5523 -115.4343 -126.7211
quadrupole: 0.0374 0.1098 -0.0056
quadrupole: 1.0170 5.1349 -6.1519 0.0374 0.1098 -0.0056
hfenergy: -920.9627103 hartree
pointgroup: C01 [X(C20H16O2)]
dipole: 0.3010314 -0.0053225 -0.2170078 debye
polarizability: 249.0068167|-0.5547297|244.3134147|-23.518005|-1.6380757|152.9981839 unknown
InChI: InChI=1S/C20H16O2/c1-14-8-2-3-9-15(14)20(21)16-10-4-6-12-18(16)22-19-13-7-5-11-17(19)20/h2-13,21H,1H3
charge 0 multiplicity 1
38 atoms
O  2.615429 0.005658 -0.421243
O  -0.266809 0.056004 2.280157
C  -0.130285 0.028124 0.783315
C  0.638246 -1.242248 0.411042
C  0.638274 1.283837 0.363773
C  -1.57968 0.018726 0.245829
C  1.949168 -1.202062 -0.120117
C  1.949419 1.22392 -0.16507
C  -1.850531 -0.009581 -1.159058
C  0.066708 -2.515964 0.661979
C  0.066471 2.566084 0.566079
C  -2.657659 0.040098 1.164086
C  2.680713 -2.379544 -0.393104
C  2.68108 2.390249 -0.4819
C  -3.204363 -0.01544 -1.581345
C  0.776336 -3.701539 0.394127
C  0.77615 3.74072 0.253937
C  -0.761743 -0.034129 -2.219514
C  -3.998457 0.033666 0.721233
C  2.091131 -3.630832 -0.135022
C  2.091284 3.650294 -0.27145
C  -4.275852 0.00569 -0.661697
H  -0.946667 -2.55412 1.075433
H  -0.94711 2.619843 0.977226
H  -2.427219 0.061912 2.231372
H  0.649817 0.061151 2.658839
H  3.691207 -2.290253 -0.802636
H  3.691642 2.285588 -0.887593
H  -3.416979 -0.037158 -2.657146
H  0.31565 -4.674246 0.594459
H  0.315243 4.720284 0.41693
H  -0.102912 0.850746 -2.154469
H  -0.114748 -0.925062 -2.124945
H  -1.205887 -0.048117 -3.229366
H  -4.814737 0.050512 1.451966
H  2.651383 -4.548094 -0.345824
H  2.651462 4.559047 -0.516538
H  -5.310374 0.000439 -1.023452
