program: Gaussian 09
title: 000228246
version: EM64L-G09RevD.01
frameworkgroup: C1[X(C15H16N4O2S)]
method: RPBEPBE
basis: SDD
operation: Freq
keyword: #p
keyword: freq=noraman
keyword: PBEPBE/SDD
title: #p freq=noraman PBEPBE/SDD
converged: NO YES NO YES
title: Mulliken charges:
elementType: S O O N N N N C C C C C C C C C C C C C C C H H H H H H H H H H H H H H H H
charge: 0.201865 -0.238086 -0.276010 -0.181976 -0.193641 -0.226138 0.024102 0.273152 -0.084428 -0.169678 0.154072 0.232781 -0.609770 -0.617989 -0.599490 -0.774928 0.468446 -0.376083 -0.376069 -0.221038 -0.221033 -0.233667 0.244439 0.255408 0.244445 0.230145 0.294788 0.230138 0.247543 0.247548 0.272084 0.304172 0.304111 0.239993 0.240000 0.229566 0.229566 0.231657
chargesum: 0.00000
title: Mulliken charges with hydrogens summed into heavy atoms:
elementType: S O O N N N N C C C C C C C C C C C C C C C
charge: 0.201865 -0.238086 -0.276010 -0.181976 -0.193641 -0.226138 0.024102 0.273152 -0.084428 -0.169678 0.154072 0.232781 0.134523 0.137082 0.167686 -0.166645 0.468446 -0.136090 -0.136070 0.008528 0.008534 -0.002010
polarizability: 3.51326277e+02 -4.35040353e+00 1.91031822e+02 7.02903635e-03 -4.58857951e-03 1.39534058e+02
1716.lowfreq: -99.2351 -13.2647 -2.7526 0.0016 0.0019 0.0024 5.3477 5.4254 18.7363
frequency: -99.1500 -10.9272 18.4176 39.6636 40.6451 52.1251 68.9918 101.0647 109.4913 119.1721 129.2635 169.6257 191.9892 234.1299 234.2975 259.5190 283.9590 310.7231 317.8337 322.7160 341.3826 350.4027 364.8686 395.8338 401.8529 421.7099 466.6491 476.8147 499.7312 552.4838 579.5842 616.2793 622.1710 638.0410 648.3084 655.7403 701.5300 705.4942 745.4308 750.3482 772.5245 776.4422 811.1610 852.4245 885.3196 909.3361 928.3996 955.9353 978.3740 990.2355 997.9895 1025.8977 1026.3922 1041.9539 1075.1872 1078.6490 1114.9734 1116.1935 1123.2999 1124.0338 1130.0842 1173.8001 1188.3101 1219.4338 1222.0933 1230.9989 1251.9558 1269.5749 1284.0331 1292.6640 1325.6087 1359.4731 1384.7961 1407.1402 1413.5687 1427.4738 1440.1348 1443.7898 1448.6358 1462.3012 1471.4466 1475.4338 1476.5329 1484.1274 1493.9344 1502.7040 1506.6845 1569.2707 1593.4088 1607.6157 1613.4751 1659.8796 2995.6756 3009.2833 3011.2185 3058.2564 3089.4152 3103.5766 3105.9480 3111.1520 3117.6587 3124.4631 3126.7306 3136.3302 3138.0302 3138.9993 3150.7417 3166.8434
redmass: 1.0662 5.0573 3.8638 6.1551 4.6156 2.9751 5.7503 6.0461 3.0231 1.2963 4.6598 6.0381 4.5938 5.0583 1.7453 1.8969 3.4331 5.9670 3.6251 2.2673 6.8007 8.9860 3.4980 8.8417 2.7955 7.3415 4.4385 6.9158 6.6384 5.9177 7.9125 6.3346 5.2787 11.9906 10.7167 5.7632 1.6416 10.9806 5.8848 11.6761 5.3333 2.1873 3.9188 1.2505 1.5237 4.1662 1.4544 3.5864 1.3922 6.2727 1.3200 4.6940 2.2018 3.9382 1.4933 2.0824 1.3062 3.8833 1.1173 1.2364 1.3074 1.0525 1.1111 2.1321 2.9311 2.8702 1.4432 3.7844 6.6315 8.7962 1.2788 5.9909 8.8340 1.4015 3.8264 1.4107 2.2010 1.4166 1.1501 1.1367 1.0427 1.0693 1.0438 2.3491 1.1124 2.7302 1.0456 6.3583 6.0922 9.8618 6.1087 10.9566 1.0338 1.0337 1.0327 1.0583 1.1037 1.1023 1.1033 1.1002 1.0987 1.0851 1.0886 1.1086 1.1022 1.0921 1.0965 1.1017
irintensity: 0.3007 0.0388 1.3373 1.2571 1.6671 0.4835 1.4580 2.2294 8.5115 0.1124 3.6822 0.3298 0.2077 0.4222 0.3647 1.2546 1.8125 0.5362 2.6273 0.9620 3.9551 0.8058 2.2904 28.0347 0.0009 5.4196 3.2919 13.8469 21.5470 38.9025 6.3870 0.1306 35.3601 3.0026 0.0059 18.3425 61.6904 10.4447 18.3061 9.4512 1.4982 27.9416 15.5950 0.0025 0.1798 9.4097 2.3609 63.7235 0.0082 0.9004 0.0555 4.5378 6.6521 53.0616 8.3836 112.9583 0.2261 22.3921 1.7451 0.0357 0.0597 0.0147 2.2493 3.3990 7.7421 5.2900 53.7081 66.7231 95.3434 42.9473 0.2356 37.2568 0.3192 47.4914 66.6395 33.7818 8.8478 88.7648 49.0311 12.2944 6.8644 17.0942 17.4643 12.1224 55.9507 265.6375 33.6508 8.5215 0.9421 548.9396 0.0789 418.4067 19.1666 81.7657 30.8221 3.1215 9.3141 17.3315 31.6497 7.7941 0.7287 5.3197 0.5389 1.1835 1.0960 14.9027 37.4223 25.3368
temp: 298.150 k
press: 1.00000 atm
elementType: 16 8 8 7 7 7 7 6 6 6 6 6 6 6 6 6 6 6 6 6 6 6 1 1 1 1 1 1 1 1 1 1 1 1 1 1 1 1
symmnumber: 1
zpe: 765237.5 jmol-1
zpe.correction: 0.291464 hartree
zpe.thermalcorrener: 0.311010 hartree
zpe.thermalcorrenthalpy: 0.311954 hartree
zpe.thermalcorrgfe: 0.241523 hartree
zpe.sumelectzpe: -1347.145058 hartree
zpe.sumelectthermal: -1347.125511 hartree
zpe.sumelectthermalent: -1347.124567 hartree
zpe.sumelectthermalfe: -1347.194998 hartree
dipole: -2.6595 6.1753 0.0010
dipole: 6.7237
quadrupole: -134.0407 -135.7914 -129.5719
quadrupole: 8.8601 0.0014 -0.0053
quadrupole: -0.9061 -2.6567 3.5627 8.8601 0.0014 -0.0053
hfenergy: -1347.4365212 hartree
pointgroup: C01 [X(C15H16N4O2S1)]
dipole: 1.0320285 -2.43567 -0.0007417 debye
polarizability: 351.2695206|-5.293425|191.0885628|-0.0148091|0.0279519|139.5340734 unknown
InChI: InChI=1S/C15H16N4O2S/c1-17-12-11(13(20)19(3)15(21)18(12)2)16-14(17)22-9-10-7-5-4-6-8-10/h4-8H,9H2,1-3H3
charge 0 multiplicity 1
38 atoms
S  1.82002 -1.182986 -0.001345
O  -2.386884 2.913089 0.000658
O  -5.709693 -0.414526 0.000205
N  -0.982579 -1.549199 -0.001004
N  -3.478158 -1.140749 -0.000208
N  -4.03022 1.215181 0.000589
N  -0.306568 0.645493 -0.000429
C  -2.141639 -0.761566 -0.00042
C  -1.710617 0.577676 -0.000083
C  0.098861 -0.625311 -0.000876
C  -2.650673 1.680354 0.000474
C  -4.478388 -0.117913 0.000439
C  -0.829788 -3.014097 -0.001636
C  -3.953366 -2.539627 -0.000597
C  -5.097313 2.243846 0.000911
C  2.639503 0.565751 -0.001209
C  4.136543 0.400442 -0.000505
C  4.854518 0.323982 -1.222457
C  4.853348 0.32403 1.222136
C  6.259303 0.179009 -1.222944
C  6.25813 0.17906 1.223971
C  6.964877 0.105781 0.000853
H  -1.276473 -3.464652 -0.90285
H  0.246444 -3.248166 -0.00226
H  -1.275587 -3.465353 0.899669
H  -3.617437 -3.074381 -0.90506
H  -5.053147 -2.49529 -0.000156
H  -3.61674 -3.075101 0.90318
H  -5.732323 2.130987 0.894735
H  -5.732551 2.13134 -0.892796
H  -4.599407 3.224308 0.001032
H  2.248579 1.072092 0.893467
H  2.249404 1.071892 -0.896358
H  4.309159 0.381988 -2.1720
H  4.307077 0.382064 2.171152
H  6.802417 0.126735 -2.17297
H  6.800336 0.126824 2.174518
H  8.055033 -0.004005 0.001377
