program: Gaussian 09
title: 000228239
version: EM64L-G09RevD.01
frameworkgroup: C1[X(C10H11ClN4O2)]
method: RPBEPBE
basis: SDD
operation: Freq
keyword: #p
keyword: freq=noraman
keyword: PBEPBE/SDD
title: #p freq=noraman PBEPBE/SDD
converged: YES YES NO NO
title: Mulliken charges:
elementType: Cl O O N N N N C C C C C C C C C C H H H H H H H H H H H
charge: 0.041297 -0.281736 -0.261545 -0.155115 -0.124228 -0.224441 -0.007904 0.148671 0.139260 0.169280 0.215436 -0.435114 -0.169211 -0.635628 -0.600905 -0.031080 -0.551281 0.254605 0.236609 0.250759 0.302130 0.251461 0.269034 0.252385 0.252079 0.250431 0.218370 0.226380
chargesum: 0.00000
title: Mulliken charges with hydrogens summed into heavy atoms:
elementType: Cl O O N N N N C C C C C C C C C C
charge: 0.041297 -0.281736 -0.261545 -0.155115 -0.124228 -0.224441 -0.007904 0.148671 0.139260 0.169280 0.215436 0.056099 -0.169211 0.168723 0.172594 0.219351 -0.106531
polarizability: 1.98229855e+02 -1.08459059e+01 1.75706728e+02 -3.55127100e+00 -2.36320402e+00 8.36609100e+01
1716.lowfreq: -6.4254 -1.5001 0.0018 0.0022 0.0025 5.7537 36.9416 49.8813 70.5170
frequency: 36.7716 49.8599 70.5140 75.2548 97.4937 106.6475 118.2455 133.8841 163.1268 187.2692 218.5926 238.6935 256.0082 277.1207 322.2509 336.0284 347.0054 370.3037 395.8092 405.5761 423.0754 482.8003 498.7500 579.9503 620.7982 650.0105 665.1110 687.5223 708.8438 725.0233 739.4782 785.0923 889.4705 919.2769 957.5697 962.2816 974.1374 1009.3954 1019.0437 1081.6015 1106.6179 1129.4469 1130.2165 1167.2981 1192.1775 1224.8117 1239.0301 1282.1247 1285.6666 1297.0346 1328.2930 1349.7628 1362.3486 1392.2827 1422.1260 1428.6323 1447.5441 1461.5615 1474.0841 1474.6964 1479.4424 1486.1346 1496.3518 1566.7960 1611.9789 1643.3545 1661.1238 3003.2537 3013.8064 3032.1204 3091.3114 3100.9601 3101.8195 3106.1618 3121.7796 3122.4477 3140.6497 3201.7550
redmass: 4.0509 4.7229 4.2705 1.9880 2.8651 1.5215 1.3820 2.4798 7.8680 3.8103 7.9015 3.2319 3.7244 4.0370 6.7749 6.3760 4.8285 3.4708 5.8433 3.5179 6.6721 4.1218 4.0891 4.3688 9.8287 5.8428 11.2600 3.6874 7.0877 4.6198 10.4523 5.1520 1.7722 2.9929 3.4101 1.4306 2.6018 1.1664 2.9026 3.5056 2.0761 1.3002 1.3067 2.6459 7.0522 2.9664 5.0515 1.3325 1.4565 4.8981 4.6632 1.2707 8.0622 2.8729 1.2688 1.1818 1.1238 1.8891 1.0638 1.1296 1.1042 1.0425 2.9315 8.9674 10.2680 9.9397 4.6515 1.0329 1.0328 1.0599 1.0605 1.1029 1.1009 1.1022 1.0977 1.1034 1.1024 1.1149
irintensity: 0.2202 0.5689 0.0904 2.3323 0.7373 1.7881 0.3577 9.0699 3.4238 3.3715 0.7661 6.9021 2.1056 1.5013 1.7518 6.1675 7.8575 7.0560 18.6193 4.0357 11.8442 4.9543 6.4215 9.9243 3.1438 2.8912 0.8995 13.6118 7.9884 13.2153 16.2707 3.8462 6.7666 9.0054 72.4076 51.6099 8.9849 22.2247 54.5727 1.2146 76.0274 0.5011 0.0516 9.2465 9.4240 2.8153 74.2849 13.7895 35.0060 41.7164 138.0228 1.4338 148.6559 49.3151 44.8148 17.7331 28.7526 166.8713 24.3001 52.8093 41.2105 21.8606 62.5367 1.9783 623.3939 398.0045 10.4075 35.6503 25.6885 14.3363 5.7325 12.7945 0.8717 15.9568 5.9663 1.6765 0.8150 21.6932
temp: 298.150 k
press: 1.00000 atm
elementType: 17 8 8 7 7 7 7 6 6 6 6 6 6 6 6 6 6 1 1 1 1 1 1 1 1 1 1 1
symmnumber: 1
zpe: 542881.4 jmol-1
zpe.correction: 0.206773 hartree
zpe.thermalcorrener: 0.223409 hartree
zpe.thermalcorrenthalpy: 0.224353 hartree
zpe.thermalcorrgfe: 0.161493 hartree
zpe.sumelectzpe: -1215.940833 hartree
zpe.sumelectthermal: -1215.924196 hartree
zpe.sumelectthermalent: -1215.923252 hartree
zpe.sumelectthermalfe: -1215.986113 hartree
dipole: -2.3658 -0.1716 0.3580
dipole: 2.3989
quadrupole: -105.9823 -109.1933 -103.9165
quadrupole: 3.7466 0.7966 2.3177
quadrupole: 0.3817 -2.8293 2.4476 3.7466 0.7966 2.3177
hfenergy: -1216.1476054 hartree
pointgroup: C01 [X(C10H11Cl1N4O2)]
dipole: -0.8933377 0.2749264 0.1308925 debye
polarizability: 188.0155206|-15.605782|185.9852887|-3.0622725|-1.4374317|83.5966838 unknown
InChI: InChI=1S/C10H11ClN4O2/c1-4-5-15-7-6(13(2)9(11)12-7)8(16)14(3)10(15)17/h4H,1,5H2,2-3H3
charge 0 multiplicity 1
28 atoms
Cl -3.528722 2.501019 -0.216127
O  -1.314742 -2.902916 0.428952
O  2.984357 -1.134889 -0.39714
N  1.184769 0.359635 -0.437445
N  -2.332061 0.030185 0.063479
N  0.834231 -1.99245 -0.001458
N  -0.872446 1.739779 -0.409727
C  -1.040229 -0.53107 0.00208
C  -0.179936 0.540899 -0.2867
C  -0.591057 -1.890248 0.168376
C  1.742365 -0.930014 -0.284242
C  2.094872 1.513722 -0.693704
C  -2.152612 1.378653 -0.192311
C  -3.591972 -0.683728 0.341435
C  1.451367 -3.332106 0.140268
C  2.689388 2.066223 0.58892
C  2.436355 3.311981 1.058352
H  2.895344 1.141824 -1.356675
H  1.503199 2.282471 -1.216346
H  -4.287649 -0.57318 -0.507029
H  -3.347137 -1.747004 0.486288
H  -4.064485 -0.282346 1.253448
H  0.643163 -4.043561 0.362973
H  2.193765 -3.321102 0.954712
H  1.966342 -3.610954 -0.793412
H  3.36993 1.391682 1.126328
H  2.901826 3.681018 1.979223
H  1.754476 3.994679 0.536681
