program: Gaussian 09
title: 000228238
version: EM64L-G09RevD.01
frameworkgroup: C1[X(C9H17NO)]
method: RPBEPBE
basis: SDD
operation: Freq
keyword: #p
keyword: freq=noraman
keyword: PBEPBE/SDD
title: #p freq=noraman PBEPBE/SDD
converged: NO YES NO NO
title: Mulliken charges:
elementType: O N C C C C C C C C C H H H H H H H H H H H H H H H H H
charge: -0.265274 -0.617756 0.034475 -0.421116 -0.443285 -0.416750 -0.406071 -0.390423 -0.363458 -0.594929 0.226656 0.235583 0.195305 0.183014 0.228979 0.181627 0.196137 0.197998 0.198595 0.187801 0.186402 0.197195 0.199578 0.187119 0.237009 0.202530 0.312192 0.330868
chargesum: 0.00000
title: Mulliken charges with hydrogens summed into heavy atoms:
elementType: O N C C C C C C C C C
charge: -0.265274 0.025303 0.270058 -0.042796 -0.032680 -0.022616 -0.019675 -0.006826 0.023239 -0.155390 0.226656
polarizability: 1.20833592e+02 -4.23837991e+00 9.49079315e+01 6.21312653e+00 1.31768358e+00 9.36936411e+01
1716.lowfreq: -6.1398 -0.0006 -0.0005 -0.0005 9.5762 23.7133 36.4381 57.3830 83.9808
frequency: 31.0630 57.3262 83.9771 141.3886 151.4574 221.0136 280.8755 305.8436 331.7933 356.3707 390.9737 427.7542 485.2737 498.3780 514.1182 535.6719 607.8080 676.1034 729.8959 786.8474 818.6198 821.7477 846.5191 849.8503 891.8412 925.3512 954.4269 1006.1364 1016.1780 1034.4714 1051.2603 1064.8334 1070.9047 1131.1145 1145.2507 1151.0455 1193.3308 1202.7184 1207.5544 1238.9149 1270.9623 1279.1992 1280.0511 1302.9539 1324.6292 1337.3274 1341.8225 1350.1500 1351.8127 1357.6786 1361.7027 1369.7595 1440.4689 1462.2876 1464.4995 1466.6270 1468.8181 1478.4091 1484.5628 1593.2421 1639.1499 2947.8423 2952.5064 2955.1837 2961.7871 2967.7134 2968.6084 2972.3617 2988.0595 3005.8309 3007.2079 3012.9996 3021.4914 3028.3568 3029.7636 3038.9297 3515.2714 3673.7961
redmass: 4.7025 3.6091 3.2808 3.3340 1.9170 2.3998 2.7282 2.6145 2.6003 2.2288 2.1690 2.3541 1.6214 1.6908 1.4098 2.3863 1.6356 2.0903 2.1373 2.0588 1.7203 1.9606 1.7202 2.0956 2.5055 2.0189 2.1908 1.5580 2.1319 1.5260 1.6557 2.3212 2.4721 1.9176 2.1389 1.4142 1.3640 1.3862 1.3452 1.2569 1.2266 1.2328 1.2197 1.4487 1.2520 1.3702 1.4382 1.5435 1.4583 1.5672 1.7407 1.5135 1.1157 1.0814 1.0874 1.0840 1.0892 1.0861 1.0846 1.4695 3.3703 1.0626 1.0596 1.0609 1.0648 1.0606 1.0615 1.0649 1.0814 1.0991 1.0986 1.0968 1.1013 1.0998 1.1018 1.0997 1.0446 1.1041
irintensity: 12.9426 3.1642 0.6030 6.4267 0.4163 0.0636 0.3106 1.0792 1.7237 0.6427 2.0960 0.6534 26.3847 4.8544 153.3183 23.9111 58.3449 45.7420 0.8563 0.5812 7.8680 1.4662 3.2221 2.2920 4.3753 1.5971 3.5671 2.1670 3.1983 3.5690 1.4829 2.6574 0.1387 0.3707 2.9188 9.3458 1.8530 8.1229 1.9018 0.9513 3.3766 0.6875 6.2924 60.7612 1.2898 0.2035 0.1169 2.8660 14.2572 22.6030 54.8281 19.2242 11.2405 1.8143 12.0465 4.9310 10.5178 11.8120 14.0747 60.8062 266.9667 30.4149 19.9841 27.7209 41.7435 14.7655 65.2616 17.5366 28.5022 35.1177 75.3992 22.0778 24.8126 66.1144 22.9961 148.0839 27.1778 20.2765
temp: 298.150 k
press: 1.00000 atm
elementType: 8 7 6 6 6 6 6 6 6 6 6 1 1 1 1 1 1 1 1 1 1 1 1 1 1 1 1 1
symmnumber: 1
zpe: 656210.5 jmol-1
zpe.correction: 0.249937 hartree
zpe.thermalcorrener: 0.261498 hartree
zpe.thermalcorrenthalpy: 0.262443 hartree
zpe.thermalcorrgfe: 0.211867 hartree
zpe.sumelectzpe: -482.254592 hartree
zpe.sumelectthermal: -482.243031 hartree
zpe.sumelectthermalent: -482.242086 hartree
zpe.sumelectthermalfe: -482.292662 hartree
dipole: -0.7288 -0.4404 -3.6505
dipole: 3.7485
quadrupole: -59.5957 -68.0986 -72.0350
quadrupole: -0.7542 11.2437 -0.5477
quadrupole: 6.9808 -1.5222 -5.4586 -0.7542 11.2437 -0.5477
hfenergy: -482.5045291 hartree
pointgroup: C01 [X(C9H17N1O1)]
dipole: 0.2839443 -0.3352807 1.4078209 debye
polarizability: 121.0013963|3.0104924|95.0489034|6.5395235|-1.2952152|93.3848645 unknown
InChI: InChI=1S/C9H17NO/c10-9(11)7-8-5-3-1-2-4-6-8/h8H,1-7,10H2
charge 0 multiplicity 1
28 atoms
O  2.563319 0.287745 -1.503036
N  3.724305 0.105748 0.493743
C  0.09747 -0.43542 0.029871
C  -1.001956 -1.448767 0.455956
C  -0.051894 0.971728 0.67498
C  -2.263493 -1.399292 -0.444628
C  -1.4961 1.533022 0.778788
C  -3.155636 -0.14277 -0.293883
C  -2.431972 1.223065 -0.420286
C  1.515842 -1.00217 0.313393
C  2.62484 -0.147065 -0.314294
H  0.036003 -0.314281 -1.070531
H  -1.283879 -1.292428 1.517945
H  -0.58532 -2.475484 0.396005
H  0.571022 1.675941 0.089326
H  0.383144 0.94727 1.697397
H  -2.888809 -2.292646 -0.241076
H  -1.932985 -1.485627 -1.50067
H  -1.422502 2.630089 0.917363
H  -1.982676 1.143966 1.696568
H  -3.657699 -0.171677 0.696321
H  -3.962801 -0.200057 -1.052514
H  -1.86641 1.27309 -1.372951
H  -3.206651 2.013696 -0.478656
H  1.596714 -2.010223 -0.140769
H  1.671573 -1.12083 1.404638
H  3.775789 -0.22491 1.455167
H  4.500164 0.644385 0.108034
