program: Gaussian 09
title: 000228225
version: EM64L-G09RevD.01
frameworkgroup: C1[X(C8H15NO)]
method: RPBEPBE
basis: SDD
operation: Freq
keyword: #p
keyword: freq=noraman
keyword: PBEPBE/SDD
title: #p freq=noraman PBEPBE/SDD
converged: YES YES NO NO
title: Mulliken charges:
elementType: O N C C C C C C C C H H H H H H H H H H H H H H H
charge: -0.289291 -0.123813 -0.332512 -0.365991 0.143509 -0.672872 -0.649165 0.346211 -0.801063 -0.666205 0.255353 0.198308 0.246292 0.217121 0.202835 0.260795 0.216603 0.215223 0.220817 0.219379 0.218604 0.221339 0.269311 0.227260 0.221950
chargesum: 0.00000
title: Mulliken charges with hydrogens summed into heavy atoms:
elementType: O N C C C C C C C C
charge: -0.289291 -0.123813 0.121149 0.097423 0.143509 0.007361 0.006254 0.346211 -0.091809 -0.216995
polarizability: 1.09819208e+02 -1.98947218e+00 1.08362407e+02 1.11376262e+00 -2.30632409e+00 7.36684177e+01
1716.lowfreq: -12.9017 0.0004 0.0004 0.0006 12.8371 16.4651 54.7041 64.8789 90.9881
frequency: 54.6892 64.5546 90.8206 112.5450 148.7031 183.8573 194.1740 209.2650 240.4768 273.0787 314.5485 335.7467 355.4976 404.6389 476.6010 552.1629 558.1610 642.6098 691.9444 756.5005 774.9764 787.0023 864.9895 935.4599 947.1436 953.9022 1001.7529 1022.3419 1053.7820 1070.3645 1079.5477 1101.0958 1122.6602 1208.4968 1231.5307 1293.8490 1305.4226 1347.2951 1359.3640 1383.0871 1385.1081 1387.2584 1406.3497 1431.8599 1452.8638 1453.6421 1466.1186 1471.1074 1472.1693 1478.6354 1483.1699 1487.6904 1546.7635 1651.9066 2972.6341 2976.4652 2985.5107 2985.8097 3016.0226 3061.3958 3069.5510 3070.9659 3085.5856 3086.0669 3094.6973 3096.1251 3099.5022 3107.5034 3197.2946
redmass: 2.9471 3.6667 2.8208 2.6065 2.6110 1.0554 1.3969 1.1464 2.0251 2.5490 2.8600 2.6484 3.2123 2.3777 3.5673 2.5832 3.2904 1.7384 3.2538 1.8665 1.2670 1.2695 2.4116 1.9273 1.8389 1.4120 1.5085 2.2816 1.5209 2.1870 1.8119 1.7660 2.0157 3.0628 1.9984 1.5367 1.5250 1.2408 1.3130 1.2174 1.2112 1.2357 1.9639 1.3741 1.1355 1.0561 1.0617 1.0566 1.0900 1.0716 1.0632 1.0589 5.4614 5.0031 1.0688 1.0382 1.0363 1.0359 1.0616 1.0944 1.0998 1.0956 1.0969 1.0998 1.0707 1.0906 1.1006 1.1017 1.1139
irintensity: 0.5153 2.6636 1.9361 0.3666 0.2778 0.8805 1.1108 0.3670 4.2213 1.1534 0.3204 0.9750 11.4437 5.5995 14.3955 1.1170 7.1198 4.5556 5.7361 4.4332 8.0705 11.6938 11.7066 2.9419 4.1209 66.8623 3.3310 4.6588 5.6638 11.9334 5.5601 20.8999 73.2006 27.1466 40.9414 20.4636 27.4140 2.4055 13.4231 22.1097 9.6565 48.3712 41.9244 36.9875 36.4036 5.1112 6.8277 7.8963 0.5134 40.6243 10.1507 23.0563 232.1030 11.0236 35.5312 24.7472 33.8145 22.2012 36.9401 16.3956 14.7220 7.6711 49.7148 23.7886 2.4440 37.4135 17.9594 27.3891 20.5597
temp: 298.150 k
press: 1.00000 atm
elementType: 8 7 6 6 6 6 6 6 6 6 1 1 1 1 1 1 1 1 1 1 1 1 1 1 1
symmnumber: 1
zpe: 568133.0 jmol-1
zpe.correction: 0.216390 hartree
zpe.thermalcorrener: 0.228749 hartree
zpe.thermalcorrenthalpy: 0.229693 hartree
zpe.thermalcorrgfe: 0.178196 hartree
zpe.sumelectzpe: -443.003946 hartree
zpe.sumelectthermal: -442.991588 hartree
zpe.sumelectthermalent: -442.990644 hartree
zpe.sumelectthermalfe: -443.042140 hartree
dipole: 1.3330 3.1139 1.9083
dipole: 3.8878
quadrupole: -56.1199 -65.6795 -63.9152
quadrupole: -1.6205 -2.3132 -3.1961
quadrupole: 5.7849 -3.7746 -2.0103 -1.6205 -2.3132 -3.1961
hfenergy: -443.2203365 hartree
pointgroup: C01 [X(C8H15N1O1)]
dipole: 0.305926 1.4249135 0.4643368 debye
dipolederiv: -0.7101717 0.1283397 0.0254035 -0.2561041 -1.1067325 -0.1064909 -0.0482328 -0.1743954 -0.385023 -0.9027052 -0.3020136 -0.0531583 -0.2804583 -0.8984738 0.003542 0.0720237 0.0719541 -0.3357647 0.5102972 -0.1039226 0.0072286 -0.1684746 0.190676 -0.0481268 -0.090814 -0.1011085 0.2238148 0.0603333 -0.0289404 0.0498451 0.0968905 0.6211704 0.02999 0.1024282 0.0369131 0.2488877 1.288677 0.277367 0.0164778 0.6041073 1.2433702 0.2069281 0.0368798 0.1509782 0.1448199 -0.0634615 0.0271131 -0.0352606 0.0397737 0.0102795 0.0653768 -0.0355585 0.1060983 -0.0420056 0.0879586 -0.0091409 -0.0003701 -0.0287338 -0.1028733 0.0638202 -0.0035222 0.1047196 -0.0244802 -0.0695796 0.0890757 -0.0763138 -0.0030107 0.1424286 -0.235692 -0.0894489 -0.1946011 0.1206347 -0.0019193 -0.0307495 0.0482232 0.0069481 -0.1057109 0.1004586 0.0634866 0.0773584 -0.0069881 -0.0723216 -0.0080082 -0.1244786 -0.0854269 -0.2858006 -0.0671498 -0.1231664 -0.1031662 -0.2516421 0.0644215 -0.0077953 -0.0602732 0.0702259 0.0126536 -0.0965741 -0.016115 -0.0429588 -0.0273521 -0.0464383 -0.060613 0.0323753 -0.091779 -0.0664003 0.1236377 0.0298017 0.0886632 0.0380056 -0.0015566 0.0654004 0.1153578 0.0312148 0.0197878 0.0258551 0.0830366 0.0203949 0.0264057 -0.0573787 -0.0601104 -0.1557039 -0.0442611 -0.0232806 0.0155624 -0.1329525 -0.0279227 -0.0465915 0.0951133 0.000712 -0.0164249 -0.0333164 -0.0291492 -0.1404511 -0.046479 -0.0970444 -0.0726153 0.0771777 -0.1100009 0.0477959 -0.0570833 -0.0225077 0.070061 0.0289403 0.0385418 0.05957 -0.1743962 0.0891477 0.0515478 0.0970187 0.0764519 -0.0133109 0.0599609 -0.0276982 0.0631802 -0.1037874 -0.0073089 0.1222633 0.0458729 0.1049434 -0.0188217 0.0925109 0.0108962 0.0202547 -0.0507872 0.0194941 -0.1356523 -0.0181646 0.0933343 -0.0196263 -0.1097037 0.0085478 -0.0129976 0.0943016 0.0048983 0.0031147 -0.0211409 -0.1645043 -0.0773452 0.002966 -0.1092564 0.0376989 -0.1573691 0.0193615 0.0629416 0.0858578 0.0798087 0.0052066 0.0208291 0.026269 0.0811669 0.0516089 -0.0344415 -0.1023824 -0.0174342 0.0952552 -0.0182594 -0.0645296 0.0296009 -0.1100142 0.1409523 0.0155197 0.0325023 -0.0042859 -0.054893 -0.0186942 -0.0117472 -0.0564654 0.0866909 -0.121943 0.0600006 0.0505068 0.0467011 0.1152182 0.0381342 0.0733692 0.0405583 0.1286401 0.0629738 -0.0333848 0.0944343 -0.0149371 0.0549484 0.11197 0.1060367 0.1231234 0.0357043 unknown
polarizability: 110.6124799|-1.8521345|105.6246233|-0.8703374|-8.1660285|75.61293 unknown
InChI: InChI=1S/C8H15NO/c1-5-9(6-2)8(10)7(3)4/h3,5-6H2,1-2,4H3
charge 0 multiplicity 1
25 atoms
O  -0.135258 -1.926557 -0.367974
N  0.705961 0.224987 -0.09386
C  2.045257 -0.281683 -0.495207
C  0.653644 1.591938 0.475239
C  -0.33556 -0.69941 -0.071343
C  2.803988 -0.947506 0.673527
C  0.787374 2.71299 -0.578319
C  -1.738371 -0.258473 0.303156
C  -2.426985 -1.161324 1.307859
C  -2.369498 0.764615 -0.333495
H  1.897023 -1.019017 -1.301736
H  2.622556 0.568408 -0.90208
H  -0.295217 1.706313 1.022855
H  1.474145 1.687071 1.215896
H  2.947278 -0.24807 1.517909
H  2.243502 -1.827351 1.030391
H  3.802194 -1.28412 0.338206
H  1.73515 2.634404 -1.140559
H  -0.042709 2.677198 -1.305079
H  0.770856 3.700937 -0.08215
H  -3.489859 -0.893348 1.431482
H  -1.933485 -1.106253 2.297874
H  -2.351254 -2.210734 0.971745
H  -3.421423 0.996678 -0.128866
H  -1.87231 1.372401 -1.09717
