program: Gaussian 09
title: 000228223
version: EM64L-G09RevD.01
frameworkgroup: C1[X(C12H21NO6)]
method: RPBEPBE
basis: SDD
operation: Freq
keyword: #p
keyword: freq=noraman
keyword: PBEPBE/SDD
title: #p freq=noraman PBEPBE/SDD
converged: YES YES NO NO
title: Mulliken charges:
elementType: O O O O O O N C C C C C C C C C C C C H H H H H H H H H H H H H H H H H H H H H
charge: -0.264651 -0.264593 -0.264651 -0.245117 -0.245064 -0.245053 -0.125513 -0.354131 -0.353614 -0.354098 -0.499666 -0.500144 -0.499923 0.244769 0.245179 0.245021 -0.505678 -0.505833 -0.505758 0.208985 0.234941 0.208701 0.234682 0.208895 0.234472 0.256528 0.248194 0.256710 0.248029 0.256524 0.248277 0.234640 0.242442 0.240789 0.234644 0.242162 0.241054 0.234671 0.242367 0.240812
chargesum: 0.00000
title: Mulliken charges with hydrogens summed into heavy atoms:
elementType: O O O O O O N C C C C C C C C C C C C
charge: -0.264651 -0.264593 -0.264651 -0.245117 -0.245064 -0.245053 -0.125513 0.089795 0.089770 0.089268 0.005056 0.004595 0.004878 0.244769 0.245179 0.245021 0.212193 0.212027 0.212092
polarizability: 1.81593593e+02 -2.89286964e-02 1.81132164e+02 -3.44844214e-02 -2.37510345e-02 1.14689120e+02
1716.lowfreq: -2.1375 0.0006 0.0009 0.0010 4.0746 7.5830 18.3353 19.8039 21.0166
frequency: 18.3245 19.7905 20.9505 23.6692 24.7024 30.8461 55.2910 55.8255 60.3697 93.2984 99.7393 103.8324 121.9861 124.3010 126.5059 171.9747 186.7221 188.5354 189.4202 228.4940 230.6048 261.7802 285.7566 285.8856 340.6750 382.8122 383.4434 451.0795 484.0467 485.2637 570.8230 570.9434 574.7213 653.7840 673.3858 673.5121 781.9149 783.7544 784.6377 795.2149 840.3181 840.5815 888.2520 953.5387 954.4810 954.7950 1015.6357 1016.1697 1045.7642 1068.1200 1068.9693 1070.4457 1112.2701 1112.5263 1112.8956 1116.6358 1117.7734 1140.8500 1148.0065 1148.2788 1148.6349 1150.0496 1150.4773 1189.4538 1217.1183 1217.8043 1271.4034 1292.1226 1293.1416 1311.1966 1311.9796 1313.9961 1376.9326 1380.5272 1392.4366 1422.2813 1422.5310 1422.6960 1441.9367 1446.1771 1446.7624 1452.7458 1452.9388 1453.4016 1463.9630 1464.1418 1464.1923 1477.6746 1479.4289 1479.8636 1640.8793 1642.0589 1642.1676 2886.2476 2886.7327 2898.2284 3001.2297 3001.3741 3001.7749 3004.4397 3004.6783 3004.9233 3056.3740 3057.0717 3057.2619 3075.2341 3079.9503 3080.4821 3105.7606 3106.1170 3106.3506 3149.5011 3149.9417 3150.1120
redmass: 6.0224 7.5484 6.1778 4.8289 4.9032 3.8653 2.7862 3.0412 2.6702 1.0827 1.0768 1.0607 3.3149 3.3930 3.4421 3.2980 4.2343 3.2635 3.2625 2.8790 2.8423 3.6441 4.2728 4.2534 3.9257 4.9673 4.9848 3.4130 3.0290 3.0409 3.2309 3.2213 3.0080 5.1739 4.2477 4.2532 1.4283 1.4353 1.4000 3.9800 5.5861 5.6171 4.5220 6.0911 5.8532 5.8841 2.5036 2.4813 2.1423 2.9399 2.9442 2.8361 1.2783 1.2787 1.2767 2.1304 2.1582 3.0730 1.4917 1.5041 1.4673 2.3426 2.3279 1.2541 1.7236 1.6736 1.1757 1.2783 1.2729 1.5986 1.5800 1.4794 1.4010 1.3879 1.4624 1.1940 1.1931 1.1971 1.0885 1.0817 1.0817 1.0502 1.0500 1.0501 1.0506 1.0505 1.0504 1.0881 1.0840 1.0821 8.9566 8.9430 8.9337 1.0721 1.0721 1.0712 1.0616 1.0615 1.0611 1.0315 1.0309 1.0308 1.0872 1.0905 1.0904 1.0971 1.0950 1.0950 1.1045 1.1046 1.1046 1.1048 1.1047 1.1047
irintensity: 2.7193 1.0905 0.9724 0.5188 0.2534 0.3444 0.0425 0.0743 0.0126 0.2228 0.2047 0.2384 2.0222 2.2333 2.1160 3.3742 17.2549 5.9476 6.0794 5.9999 6.4126 0.6828 24.9320 24.9724 10.9280 4.4023 4.2143 13.7811 2.1205 2.0514 4.2077 4.1371 1.4973 1.3440 17.4681 17.4847 10.3795 13.5977 15.6899 0.0418 6.9912 7.1878 16.4506 0.7669 37.8321 37.2862 66.2806 65.3945 17.9089 42.0449 42.3406 2.0548 2.4693 2.2542 2.3201 55.4474 59.2214 18.4166 20.4810 19.0129 5.2788 330.7066 330.2659 0.9242 28.9942 26.3964 5.9741 4.3739 6.4145 117.6911 124.8173 8.3571 41.7924 35.5587 3.5208 30.6520 31.5551 12.0571 19.6362 13.9008 13.9365 13.5657 14.6288 14.7357 12.8040 13.8583 9.2110 13.2284 12.6438 12.6020 97.1865 192.6702 192.0159 26.6379 26.4658 156.1590 11.2332 12.8777 17.1679 34.4345 32.2836 22.6876 0.8480 4.0370 4.0993 5.9146 32.0326 31.6637 26.1355 26.8475 28.8935 16.2102 16.2441 16.3310
temp: 298.150 k
press: 1.00000 atm
elementType: 8 8 8 8 8 8 7 6 6 6 6 6 6 6 6 6 6 6 6 1 1 1 1 1 1 1 1 1 1 1 1 1 1 1 1 1 1 1 1 1
symmnumber: 1
zpe: 853666.1 jmol-1
zpe.correction: 0.325144 hartree
zpe.thermalcorrener: 0.348777 hartree
zpe.thermalcorrenthalpy: 0.349721 hartree
zpe.thermalcorrgfe: 0.264857 hartree
zpe.sumelectzpe: -974.432946 hartree
zpe.sumelectthermal: -974.409313 hartree
zpe.sumelectthermalent: -974.408369 hartree
zpe.sumelectthermalfe: -974.493233 hartree
dipole: 0.0166 -0.0084 -1.4828
dipole: 1.4829
quadrupole: -101.7965 -101.9875 -113.1501
quadrupole: -0.0787 0.0371 0.0547
quadrupole: 3.8482 3.6572 -7.5054 -0.0787 0.0371 0.0547
hfenergy: -974.7580904 hartree
pointgroup: C01 [X(C12H21N1O6)]
dipole: -0.0011956 -0.0073605 -0.5833717 debye
polarizability: 181.218827|-0.1830047|181.5062786|-0.2119414|0.0140753|114.6897717 unknown
InChI: InChI=1S/C12H21NO6/c1-17-10(14)4-7-13(8-5-11(15)18-2)9-6-12(16)19-3/h4-9H2,1-3H3
charge 0 multiplicity 1
40 atoms
O  -1.791398 -4.51134 -0.490831
O  -3.001752 3.816088 -0.49672
O  4.791302 0.683757 -0.507744
O  0.317656 -4.319323 0.477166
O  -3.897435 1.911318 0.498955
O  3.588137 2.422348 0.467948
N  -0.008229 0.000834 0.184451
C  0.001607 -1.426025 0.599853
C  -1.248138 0.708511 0.597313
C  1.225342 0.723365 0.590678
C  -0.872115 -2.299114 -0.324496
C  -1.562451 1.901192 -0.329473
C  2.413855 0.394025 -0.33613
C  -0.684035 -3.780791 -0.04927
C  -2.930371 2.495345 -0.04346
C  3.611366 1.286735 -0.061518
C  -1.696937 -5.983154 -0.326544
C  -4.314319 4.485579 -0.320264
C  6.026757 1.489007 -0.342346
H  -0.326484 -1.553951 1.659924
H  1.035411 -1.807634 0.548674
H  -1.195262 1.058374 1.656845
H  -2.096637 0.005309 0.546231
H  1.50332 0.509395 1.651214
H  1.040871 1.80947 0.532536
H  -0.577073 -2.10148 -1.37381
H  -1.945798 -2.055558 -0.250306
H  -1.550664 1.542758 -1.377595
H  -0.804638 2.700542 -0.263923
H  2.095008 0.553886 -1.384957
H  2.730572 -0.660494 -0.263275
H  -2.641592 -6.371209 -0.732048
H  -1.584533 -6.241629 0.739757
H  -0.831239 -6.375836 -0.886145
H  -4.177077 5.487968 -0.748956
H  -4.57254 4.542165 0.750556
H  -5.103488 3.928238 -0.852518
H  6.828177 0.859554 -0.753308
H  6.199265 1.708035 0.724752
H  5.941662 2.439039 -0.896419
