program: Gaussian 09
title: 000228222
version: EM64L-G09RevD.01
frameworkgroup: C1[X(C8H15NO4)]
method: RPBEPBE
basis: SDD
operation: Freq
keyword: #p
keyword: freq=noraman
keyword: PBEPBE/SDD
title: #p freq=noraman PBEPBE/SDD
converged: YES YES NO NO
title: Mulliken charges:
elementType: O O O O N C C C C C C C C H H H H H H H H H H H H H H H
charge: -0.267931 -0.267928 -0.241955 -0.241957 -0.283412 -0.359189 -0.359195 -0.498957 -0.498968 0.246828 0.246830 -0.506770 -0.506769 0.242116 0.195371 0.195366 0.242128 0.240089 0.232511 0.262265 0.262264 0.232522 0.233574 0.241684 0.242113 0.233574 0.242108 0.241689
chargesum: 0.00000
title: Mulliken charges with hydrogens summed into heavy atoms:
elementType: O O O O N C C C C C C C C
charge: -0.267931 -0.267928 -0.241955 -0.241957 -0.043324 0.078298 0.078299 -0.004181 -0.004182 0.246828 0.246830 0.210601 0.210602
polarizability: 1.53519712e+02 9.18965596e-04 9.80776646e+01 -6.04327340e-04 3.05904418e-01 7.48217016e+01
1716.lowfreq: -0.0008 -0.0008 -0.0007 0.3099 5.3474 8.4873 16.6508 19.1512 36.6880
frequency: 16.4253 19.1388 35.9133 55.3463 60.2355 90.9734 91.3977 108.7642 127.3309 131.7037 183.9755 190.1230 190.3480 225.0059 279.1672 324.1528 391.7476 413.8024 485.8027 568.0761 577.1861 654.9731 676.9458 704.1371 791.1003 799.2302 832.6067 844.3192 949.2455 954.7435 1021.0676 1026.1889 1055.4016 1079.9757 1100.5800 1112.1815 1113.0334 1116.8939 1147.4593 1148.2174 1148.3804 1154.8363 1171.7639 1209.4575 1255.3462 1283.0174 1294.4154 1318.6695 1363.5426 1402.8546 1422.4894 1422.8447 1443.3616 1445.2504 1452.4975 1452.5073 1461.8429 1464.3667 1464.4066 1487.5716 1497.0263 1645.7998 1646.8972 2881.4435 2888.4230 2996.9022 2997.0854 3004.1727 3004.2303 3038.6433 3039.8930 3062.4162 3062.6040 3105.4683 3105.4848 3149.0952 3149.1120 3413.9869
redmass: 6.8375 3.8966 3.9485 2.8770 2.6142 1.0793 1.0988 3.1494 2.8866 2.2739 5.8394 3.3489 3.3738 3.9399 4.0619 4.9466 5.2234 4.2078 3.1041 3.0338 3.1665 4.3109 4.5439 1.4135 1.2696 1.3430 4.4937 5.8252 5.9190 6.4166 2.7198 1.8974 3.4271 1.8962 3.5005 1.3867 1.2740 2.0893 1.6546 1.4460 1.4590 2.8765 2.2466 1.4400 1.2301 1.1298 1.2875 1.6093 1.5632 1.4835 1.1927 1.2045 1.0809 1.0825 1.0502 1.0502 1.2148 1.0510 1.0506 1.0885 1.0792 9.0601 9.1381 1.0722 1.0717 1.0603 1.0604 1.0299 1.0299 1.0902 1.0896 1.0982 1.0970 1.1045 1.1045 1.1047 1.1047 1.0739
irintensity: 0.0003 0.5731 0.3241 0.0884 0.8387 0.4789 0.0169 0.0079 3.1396 3.8953 0.5791 19.6057 0.3305 9.9899 39.0497 3.9077 1.4238 1.0236 14.8315 2.3945 1.9590 27.1876 1.7934 60.3948 2.8904 19.2644 29.1081 5.7708 23.3917 2.4165 5.9325 91.8135 39.1596 6.0148 14.3386 77.4820 0.0448 343.1648 22.8793 0.3216 30.8445 23.2489 91.1216 0.9015 85.2736 1.9958 47.6679 4.1635 119.5446 0.2219 42.1009 9.7377 6.2609 41.7232 1.3211 27.3076 11.0163 10.1345 15.1404 1.5941 6.9272 9.9026 320.8045 38.1690 144.0709 14.8263 13.4418 58.6003 4.3443 0.6186 4.5281 0.1284 52.3418 0.1820 55.8986 10.4570 23.5522 1.8452
temp: 298.150 k
press: 1.00000 atm
elementType: 8 8 8 8 7 6 6 6 6 6 6 6 6 1 1 1 1 1 1 1 1 1 1 1 1 1 1 1
symmnumber: 1
zpe: 601141.6 jmol-1
zpe.correction: 0.228963 hartree
zpe.thermalcorrener: 0.245205 hartree
zpe.thermalcorrenthalpy: 0.246149 hartree
zpe.thermalcorrgfe: 0.181089 hartree
zpe.sumelectzpe: -668.434544 hartree
zpe.sumelectthermal: -668.418301 hartree
zpe.sumelectthermalent: -668.417357 hartree
zpe.sumelectthermalfe: -668.482417 hartree
dipole: 0.0001 -2.9200 0.9689
dipole: 3.0765
quadrupole: -52.6445 -87.2711 -76.1023
quadrupole: 0.0015 0.0002 -0.9349
quadrupole: 19.3615 -15.2651 -4.0964 0.0015 0.0002 -0.9349
hfenergy: -668.6635066 hartree
pointgroup: C01 [X(C8H15N1O4)]
dipole: -0.0005593 1.0399694 -0.6192996 debye
polarizability: 153.5196195|-0.0096058|97.1309894|-0.0846358|-4.6057751|75.7684693 unknown
InChI: InChI=1S/C8H15NO4/c1-12-7(10)3-5-9-6-4-8(11)13-2/h9H,3-6H2,1-2H3
charge 0 multiplicity 1
28 atoms
O  -4.854353 0.710396 -0.123918
O  4.854067 0.709677 -0.134687
O  -3.887964 -1.333281 0.436552
O  3.888457 -1.333679 0.428279
N  -0.000173 0.540919 -0.1128
C  -1.244423 -0.25625 -0.182456
C  1.243832 -0.256371 -0.185337
C  -2.461843 0.656473 0.052561
C  2.461908 0.656238 0.046725
C  -3.761469 -0.122317 0.144085
C  3.761582 -0.122766 0.135765
C  -6.189188 0.073554 -0.003624
C  6.189026 0.072607 -0.016991
H  -1.212334 -1.024631 0.610808
H  -1.367361 -0.80439 -1.14841
H  1.364434 -0.804605 -1.151533
H  1.213567 -1.024673 0.608072
H  -0.000961 1.296772 -0.81416
H  -2.56099 1.424684 -0.73651
H  -2.313877 1.203543 1.004458
H  2.316071 1.203662 0.998749
H  2.559503 1.424144 -0.742833
H  -6.903803 0.871953 -0.247313
H  -6.343528 -0.299636 1.022872
H  -6.275731 -0.769015 -0.710071
H  6.903304 0.870878 -0.262085
H  6.274047 -0.76998 -0.723602
H  6.345303 -0.300605 1.009203
