program: Gaussian 09
title: 000228221
version: EM64L-G09RevD.01
frameworkgroup: C1[X(C10H14ClN)]
method: RPBEPBE
basis: SDD
operation: Freq
keyword: #p
keyword: freq=noraman
keyword: PBEPBE/SDD
title: #p freq=noraman PBEPBE/SDD
converged: YES YES NO NO
title: Mulliken charges:
elementType: Cl N C C C C C C C C C C H H H H H H H H H H H H H H
charge: -0.085303 -0.430550 -0.423699 -0.335901 -0.338135 0.476013 -0.687353 -0.354129 -0.415911 -0.206985 -0.189748 -0.123654 0.203306 0.204471 0.209236 0.209430 0.197604 0.197871 0.295715 0.210570 0.220525 0.210654 0.243810 0.218763 0.245950 0.247448
chargesum: 0.00000
title: Mulliken charges with hydrogens summed into heavy atoms:
elementType: Cl N C C C C C C C C C C
charge: -0.085303 -0.134835 -0.015922 0.082766 0.057341 0.476013 -0.045604 -0.110319 -0.197148 0.038965 0.057700 -0.123654
polarizability: 1.99901765e+02 -4.20947354e+00 1.14465552e+02 1.17069811e-01 6.57530567e-04 6.78060074e+01
1716.lowfreq: -25.4846 -8.3803 -3.0077 -0.0020 -0.0015 0.0012 25.9143 42.2502 61.6904
frequency: 24.1986 38.4794 61.6848 90.6228 117.5931 148.0773 177.4943 230.3496 237.5202 286.5406 302.1353 320.3368 379.7307 410.5717 413.8936 496.8210 510.9103 625.4034 647.7138 690.6190 734.6115 792.3618 804.3541 813.7535 819.1201 906.8233 923.4553 937.6875 944.4364 983.1930 1023.0849 1072.2979 1079.6307 1091.8196 1108.9372 1144.0939 1153.2987 1184.1981 1219.3978 1257.2292 1277.8176 1289.5493 1290.6823 1305.2345 1343.1196 1360.8841 1372.2040 1393.0564 1411.9749 1466.9686 1470.0565 1473.5520 1479.6944 1486.0988 1497.5209 1505.4057 1583.8618 1620.6521 2922.0022 2958.0877 2960.1634 2972.9187 2975.3895 3005.5842 3034.7657 3072.1953 3076.4155 3120.3974 3150.3906 3163.8201 3171.4771 3570.2788
redmass: 2.8513 2.1640 4.5522 3.6809 2.0621 4.3502 4.0960 6.3535 1.0997 4.4825 2.5119 1.4887 4.0635 4.5801 3.0224 2.6104 3.8027 7.0812 6.6475 3.0437 1.0752 1.2370 1.3513 1.4626 4.9040 1.7963 1.3208 1.3083 1.1827 4.1132 3.6162 2.8030 2.3327 2.6665 1.5164 2.4951 1.5530 1.1136 1.3114 1.3314 1.1506 1.0774 1.3412 1.6572 1.5904 2.4431 1.9813 1.2173 4.3087 1.0943 1.6614 1.0770 1.0421 1.0715 1.4787 1.7099 5.4773 6.4308 1.0568 1.1026 1.0588 1.0589 1.0363 1.1007 1.1043 1.1009 1.0993 1.0892 1.0875 1.0952 1.0968 1.0770
irintensity: 0.5559 1.0099 0.3443 0.4224 4.4153 3.7210 0.0188 1.1247 0.0622 0.3398 9.8755 82.1023 2.1887 6.1587 0.1302 24.5385 1.3414 0.3795 38.8848 1.4841 11.6041 1.1640 31.0458 59.2674 0.7674 6.9284 0.0569 0.0028 0.4159 13.6684 0.0512 26.9997 1.4645 2.0198 7.0808 27.1227 0.4411 21.8352 0.1154 1.7464 0.4760 0.5071 5.1098 26.1902 20.2664 21.2737 45.1570 7.6619 3.5221 2.2426 4.5066 2.3243 13.3609 23.4181 262.3519 119.5386 2.6895 152.8800 51.7156 28.4750 11.4110 67.3203 36.8558 3.1722 52.7309 81.3879 47.9376 16.9108 10.6044 10.7348 6.1541 36.5837
temp: 298.150 k
press: 1.00000 atm
elementType: 17 7 6 6 6 6 6 6 6 6 6 6 1 1 1 1 1 1 1 1 1 1 1 1 1 1
symmnumber: 1
zpe: 568146.6 jmol-1
zpe.correction: 0.216396 hartree
zpe.thermalcorrener: 0.229517 hartree
zpe.thermalcorrenthalpy: 0.230461 hartree
zpe.thermalcorrgfe: 0.174901 hartree
zpe.sumelectzpe: -903.362939 hartree
zpe.sumelectthermal: -903.349818 hartree
zpe.sumelectthermalent: -903.348874 hartree
zpe.sumelectthermalfe: -903.404433 hartree
dipole: -5.1280 0.8399 -0.0094
dipole: 5.1964
quadrupole: -86.9005 -71.8594 -83.9224
quadrupole: 1.5131 0.0112 -0.0196
quadrupole: -6.0064 9.0347 -3.0283 1.5131 0.0112 -0.0196
hfenergy: -903.5793348 hartree
pointgroup: C01 [X(C10H14Cl1N1)]
dipole: -2.0094885 0.3760133 0.013247 debye
dipolederiv: -0.8966417 0.1319974 0.0053284 0.1555569 -0.1706133 -0.0019642 0.0056303 -0.0018028 -0.0817862 -1.8872553 0.0382221 0.0070068 0.2764077 -0.2179932 0.0005838 0.0143473 0.0017588 -0.4749878 -0.057597 -0.0443134 0.000963 -0.1056234 0.0740343 -0.0031543 -0.0002834 -0.0037412 0.1830672 0.5832008 0.1674711 0.0032537 0.5111137 0.3384244 -0.0017896 0.0067747 0.0005077 0.3777362 0.0414485 0.0192708 0.0016287 0.0825857 0.0997442 -0.0026413 0.0027876 -0.002428 0.1716757 1.7565172 -0.22303 -0.0107125 -0.5661922 -0.0381049 0.0004699 -0.0149141 -0.0014425 0.1446489 -0.0710461 0.0236985 0.0022995 -0.02786 0.0593648 -0.0011753 0.0007861 -0.0014043 0.0971501 -0.3366511 -0.0789572 -0.00024 0.490692 -0.010261 0.0016759 0.0075695 0.0041552 -0.2501814 -0.4687649 0.1477695 0.0033433 -0.2525325 0.0834868 0.005857 -0.0023196 0.0040052 -0.2354861 0.0142779 0.173396 0.0019741 0.0288229 0.0849033 0.0024366 -0.0001806 0.0019062 -0.0893686 -0.0566892 -0.0848054 -0.0014852 -0.0084731 0.14322 0.0034165 -0.0003948 0.0038368 -0.0864935 1.0131092 -0.2418042 -0.0080664 -0.2351076 -0.0919472 0.0014906 -0.0081284 0.0013223 -0.124653 0.0490936 -0.0008333 -0.009935 0.0266928 -0.047343 0.1144609 -0.0102649 0.1314327 -0.0739289 0.049242 -0.002073 0.0086134 0.0248107 -0.0340506 -0.1120669 0.0104468 -0.1287854 -0.0863318 -0.0179318 0.0162345 0.021532 -0.1245254 -0.0578087 -0.1029679 -0.0398328 -0.1170651 -0.100837 -0.0154985 0.0200528 -0.0235052 -0.1210456 -0.0654667 0.1049739 0.0326646 0.1170273 -0.0910658 0.0263665 0.0354864 -0.0420862 0.0061993 -0.0446292 0.1168186 -0.0281444 0.1429469 -0.0749579 0.0269724 0.0300524 0.0418499 0.0022851 -0.0293026 -0.1140966 0.0262068 -0.1408782 -0.0915586 0.1538194 -0.0073554 0.0002401 -0.0721908 0.093248 -0.0020256 -0.0025848 -0.0015257 0.3012331 0.0728142 0.012258 0.0059513 0.0675016 -0.0143713 0.1244597 -0.0427088 0.1335034 -0.078471 -0.143428 -0.1096483 -0.0010846 -0.1546797 -0.0266655 -0.0024007 -0.0021966 -0.0027667 0.1024326 0.0735643 0.0099871 -0.0084243 0.0624191 0.0009242 -0.1207878 0.0434508 -0.1289039 -0.0943757 -0.0215321 -0.0957931 -0.000949 -0.1103912 -0.0029444 -0.0022194 -0.001116 -0.0022921 0.168262 0.0165911 0.0990031 0.0020736 0.0704136 -0.0934602 -0.0041714 0.0018037 -0.0043023 0.165935 0.0788198 0.0516644 0.0011005 0.0579833 -0.0450212 -0.0033557 0.0013043 -0.003291 0.1605066 0.0171988 -0.0879508 -0.0006699 -0.084863 0.0126329 -0.0018267 -0.0007031 -0.0017733 0.1618358 unknown
polarizability: 199.6638335|-6.1337356|114.6891273|-0.7179267|0.7345773|67.8203631 unknown
InChI: InChI=1S/C10H14ClN/c1-2-3-8-12-10-6-4-9(11)5-7-10/h4-7,12H,2-3,8H2,1H3
charge 0 multiplicity 1
26 atoms
Cl 5.082355 -0.578393 -0.037679
N  -0.843529 0.682909 0.005657
C  -3.29824 0.357616 0.023714
C  -1.913442 -0.318458 -0.003761
C  -4.457038 -0.664042 0.004769
C  0.515693 0.376447 -0.004844
C  -5.845528 0.009284 0.038703
C  0.979717 -0.973786 -0.027402
C  1.486751 1.425214 0.00648
C  2.361849 -1.259998 -0.037049
C  2.864921 1.139816 -0.003551
C  3.290551 -0.204245 -0.024995
H  -3.392612 1.035235 -0.850148
H  -3.379821 0.988718 0.932778
H  -1.835215 -0.95877 -0.910004
H  -1.817092 -0.993099 0.875208
H  -4.356099 -1.347942 0.871696
H  -4.373409 -1.294877 -0.903185
H  -1.115618 1.665201 0.018307
H  -5.986559 0.674801 -0.833613
H  -6.656085 -0.741704 0.024143
H  -5.968722 0.621079 0.952072
H  0.268141 -1.80425 -0.03795
H  1.15611 2.47132 0.023413
H  2.706946 -2.298295 -0.054131
H  3.597175 1.95292 0.005272
