program: Gaussian 09
title: 000228214
version: EM64L-G09RevD.01
frameworkgroup: C1[X(C9H11NO2)]
method: RPBEPBE
basis: SDD
operation: Freq
keyword: #p
keyword: freq=noraman
keyword: PBEPBE/SDD
title: #p freq=noraman PBEPBE/SDD
converged: YES YES NO NO
title: Mulliken charges:
elementType: O O N C C C C C C C C C H H H H H H H H H H H
charge: -0.430013 -0.217727 -0.392097 -0.259714 0.435667 -0.366479 -0.390707 0.167704 -0.227429 -0.223897 -0.636902 -0.240342 0.232507 0.308600 0.277912 0.239674 0.224398 0.224657 0.196306 0.241850 0.222945 0.226770 0.386316
chargesum: 0.00000
title: Mulliken charges with hydrogens summed into heavy atoms:
elementType: O O N C C C C C C C C C
charge: -0.043697 -0.217727 -0.083497 -0.027207 0.435667 -0.088567 -0.151033 0.167704 -0.003031 0.000760 0.024199 -0.013572
polarizability: 1.31430133e+02 -5.93178056e+00 9.36352014e+01 -6.83584419e-01 1.61317949e+01 8.87534494e+01
1716.lowfreq: -7.2162 -5.8109 -0.0003 0.0007 0.0008 5.7577 18.5497 38.9372 82.7548
frequency: 18.1950 38.9060 82.7546 108.2156 171.2103 188.0387 236.0058 252.3331 326.6789 393.3403 406.8137 455.1097 482.6574 519.1433 553.9915 601.4115 615.7266 635.7736 683.7227 706.3191 752.5940 829.9183 858.6054 865.6013 937.3684 984.5694 990.6844 1002.1447 1004.0031 1024.2692 1053.4670 1076.9895 1115.4131 1149.5567 1163.8120 1169.7930 1180.2787 1217.9757 1252.1940 1286.3166 1301.5045 1329.5732 1387.2954 1436.8542 1442.6038 1450.5899 1468.7829 1478.7605 1498.0627 1597.4421 1609.2163 1663.4225 2833.9563 2879.3285 3017.1920 3082.6131 3120.4792 3127.0622 3139.3727 3150.1038 3162.6259 3520.2215 3540.7176
redmass: 8.9171 3.9259 3.8678 3.6702 1.9899 1.4833 4.2809 3.1563 5.6969 3.9521 2.8829 3.8541 2.8476 2.1041 2.2768 2.4114 5.6215 1.9080 3.7884 1.9580 1.7760 4.4363 1.3629 2.8937 1.5127 1.5079 4.2827 1.4719 2.0000 2.1297 2.3987 1.5659 1.2977 1.9154 2.6391 1.1459 1.1423 2.2197 1.5560 1.6578 1.7199 1.3683 7.4230 1.6328 1.3695 1.2220 1.1334 2.0350 1.0481 6.3136 6.1234 9.4316 1.0792 1.0559 1.0764 1.0990 1.0847 1.0881 1.0921 1.0955 1.1014 1.0642 1.0763
irintensity: 2.5469 0.6175 2.0746 0.2065 2.1066 0.6162 1.0457 6.0657 0.6865 7.0963 0.4038 15.1427 12.9798 60.7726 71.6960 22.3361 1.8976 146.3384 36.5579 47.4572 47.6544 6.4557 4.8177 20.4039 4.4734 0.3721 0.7243 4.8567 2.5075 7.4815 283.0188 7.0757 7.6978 30.1120 13.7341 0.7004 0.6477 18.2952 8.6183 23.4067 31.7334 15.9932 1.1192 6.0421 9.6212 46.2554 1.5085 17.6577 18.1005 1.3099 5.0714 176.8963 49.5993 135.4032 37.8827 33.7284 1.5966 4.1859 18.7532 24.0715 27.6524 27.8012 17.6825
temp: 298.150 k
press: 1.00000 atm
elementType: 8 8 7 6 6 6 6 6 6 6 6 6 1 1 1 1 1 1 1 1 1 1 1
symmnumber: 1
zpe: 482272.6 jmol-1
zpe.correction: 0.183688 hartree
zpe.thermalcorrener: 0.195318 hartree
zpe.thermalcorrenthalpy: 0.196262 hartree
zpe.thermalcorrgfe: 0.144344 hartree
zpe.sumelectzpe: -553.855258 hartree
zpe.sumelectthermal: -553.843628 hartree
zpe.sumelectthermalent: -553.842684 hartree
zpe.sumelectthermalfe: -553.894601 hartree
dipole: -1.2926 1.3382 -0.0334
dipole: 1.8609
quadrupole: -58.8260 -73.8968 -67.5877
quadrupole: -0.2743 -1.3377 -1.1872
quadrupole: 7.9441 -7.1266 -0.8175 -0.2743 -1.3377 -1.1872
hfenergy: -554.0389455 hartree
pointgroup: C01 [X(C9H11N1O2)]
dipole: -0.4579824 0.569716 0.0409231 debye
dipolederiv: -0.9933306 0.1571137 0.3679886 0.0152438 -0.3106886 -0.0295811 0.50451 -0.0821285 -0.6933461 -0.5442651 -0.1136925 0.0790951 -0.0270113 -0.9423808 -0.2322304 0.1784871 -0.0945099 -0.4525431 -0.4196787 0.0089302 -0.0470334 0.1407301 -0.7183263 0.0688612 -0.023932 0.0560818 -0.6000994 0.1954332 -0.4228467 0.0979627 -0.3697139 0.3424637 0.094724 0.1012859 0.2063521 0.3429104 0.2583571 0.0780832 0.0219824 -0.0294288 -0.1651447 0.0139502 0.0049478 0.000194 -0.0628863 -0.1846037 -0.0609882 -0.0717041 -0.0333454 -0.0774075 0.0673357 -0.0074525 0.0494455 -0.0579958 -0.1035681 0.0380797 0.0757858 0.0351186 -0.0886629 0.0993771 0.0279031 0.0800344 0.0060461 1.1103242 0.1178395 -0.5585371 0.290997 1.1192699 0.2390588 -0.7559195 0.1485758 0.7061625 0.0029014 0.0083698 0.0959467 0.0073456 -0.1073731 0.095737 0.0662863 0.0901339 0.0691712 -0.0220761 -0.079324 -0.068012 -0.0846507 -0.0687504 0.0993723 -0.0708973 0.0859625 0.0016062 0.1598627 0.1517496 0.0153328 -0.033974 0.4302488 -0.1669726 0.101012 -0.2056709 0.406295 0.0654231 -0.0480634 0.0391316 -0.0354903 -0.1305936 0.0386998 0.0713142 0.0381816 -0.0706685 0.0064458 0.0406092 -0.0004205 0.005709 -0.0238274 -0.0112889 -0.0329727 -0.0945915 -0.1818933 0.0798841 0.0111833 0.0485232 0.031664 0.1629251 0.0132006 -0.0473363 -0.0145784 0.3085684 0.1118375 0.0333436 0.0730197 0.023773 0.094333 -0.0762127 0.0691906 -0.0741726 0.0663746 0.0656359 -0.0208895 -0.0953838 -0.0167804 0.1066108 -0.0644398 -0.0732444 -0.0624548 -0.0211162 0.0364584 -0.01029 -0.0800386 -0.0159265 0.1064487 -0.0945977 -0.0976761 -0.086551 -0.0588619 0.0010816 0.0799772 0.0677495 0.0934715 0.0790155 -0.0961047 0.0737451 -0.0989873 0.0113363 0.0363783 -0.0023404 -0.0825016 -0.0022128 -0.031443 0.004431 -0.1191428 0.1859998 -0.2611823 -0.1477117 -0.0950041 0.0084074 -0.0314858 0.0973475 0.0100379 -0.0192653 0.0301 0.0539373 0.0568009 0.1163965 0.0449266 0.0770947 -0.1031933 -0.0562123 0.0762615 -0.1035948 0.0242988 -0.1279981 0.0545783 -0.0555215 0.0502788 0.1332216 -0.0195618 -0.0539285 -0.0194236 0.0953983 0.3564079 -0.0428151 0.0233003 -0.0914062 0.095907 0.0024166 0.026824 -0.0343981 0.3684876 unknown
polarizability: 129.901602|-10.2193035|90.8199302|1.3327166|15.9401542|93.0972515 unknown
InChI: InChI=1S/C9H11NO2/c1-10-8(9(11)12)7-5-3-2-4-6-7/h2-6,8,10-11H,1H3
charge 0 multiplicity 1
23 atoms
O  -2.918414 -0.680847 0.716265
O  -1.68678 -2.089882 -0.652936
N  -1.601384 1.515724 0.078601
C  -1.082524 0.310559 -0.565513
C  0.411594 0.063842 -0.250509
C  0.96768 0.552452 0.954486
C  1.22364 -0.664179 -1.151871
C  -1.884164 -0.946748 -0.193846
C  2.326628 0.312024 1.257696
C  2.582211 -0.906182 -0.848124
C  -1.237995 2.78505 -0.562759
C  3.137665 -0.418628 0.358163
H  -1.168542 0.356665 -1.682891
H  -2.5714 1.43431 0.390883
H  0.320066 1.125553 1.627327
H  0.792041 -1.052007 -2.08225
H  2.752561 0.693648 2.192836
H  3.205491 -1.471939 -1.549791
H  -1.565376 2.864473 -1.628267
H  -0.140772 2.92055 -0.542143
H  -1.687715 3.62231 -0.001591
H  4.192075 -0.604277 0.592721
H  -3.400282 -1.527673 0.919015
