program: Gaussian 09
title: 000228212
version: EM64L-G09RevD.01
frameworkgroup: C1[X(C9H17NO2)]
method: RPBEPBE
basis: SDD
operation: Freq
keyword: #p
keyword: freq=noraman
keyword: PBEPBE/SDD
title: #p freq=noraman PBEPBE/SDD
converged: NO YES NO NO
title: Mulliken charges:
elementType: O O N C C C C C C C C C H H H H H H H H H H H H H H H H H
charge: -0.436207 -0.240368 -0.348258 0.300823 -0.460940 -0.483390 -0.397656 -0.424999 -0.387447 0.115914 -0.406997 -0.666972 0.217862 0.218468 0.215845 0.217807 0.208491 0.197012 0.192758 0.238443 0.187752 0.201473 0.266098 0.212359 0.228967 0.245646 0.203007 0.211807 0.372706
chargesum: 0.00000
title: Mulliken charges with hydrogens summed into heavy atoms:
elementType: O O N C C C C C C C C C
charge: -0.063502 -0.240368 -0.082160 0.300823 -0.024609 -0.049739 0.007846 0.006202 0.001777 0.115914 0.034328 -0.006513
polarizability: 1.18623856e+02 1.80952447e+00 1.03000048e+02 1.45720215e+00 -8.14311074e-01 1.00840862e+02
1716.lowfreq: -20.1113 -0.0006 -0.0005 0.0005 10.7954 17.5737 29.4388 51.9661 99.4316
frequency: 25.7521 51.7928 99.3399 126.5513 162.3637 190.8503 212.3464 252.6832 280.9763 287.9250 319.3278 369.2903 404.5194 422.3876 473.3566 499.8492 511.3381 520.9439 586.0612 625.7712 666.8659 714.9147 781.0199 789.4147 810.7369 845.0695 873.1554 902.3381 921.0750 934.6801 960.6940 1013.5795 1032.3810 1060.4221 1070.9700 1084.2269 1098.0578 1133.2834 1136.6465 1155.6990 1162.2587 1232.4370 1239.4070 1260.4723 1268.6305 1289.8987 1309.6063 1316.3394 1336.0605 1337.5759 1342.0198 1346.6792 1361.7525 1383.8443 1453.8416 1460.7319 1465.1301 1469.0019 1469.4745 1472.5474 1477.2005 1479.8767 1491.3755 1633.4878 2965.8113 2971.2372 2974.8791 2986.7866 2988.9754 2991.0612 2993.7754 3029.5852 3034.6683 3046.0514 3050.0168 3056.1611 3061.6659 3069.5461 3091.9699 3453.1423 3514.0526
redmass: 2.7390 7.2116 2.8972 3.9678 2.6797 1.7683 2.7744 1.6599 2.1962 2.6391 3.0125 1.9866 2.7089 3.0168 2.6820 2.4260 2.7230 2.2440 1.3033 1.6709 3.0945 4.3748 1.3203 1.4614 2.2242 2.0669 1.8277 2.1603 2.1309 1.4292 2.4144 2.8157 2.7315 1.9251 1.5084 1.9468 1.5853 1.6021 1.6808 2.6737 2.5441 1.9017 1.4576 1.3361 1.2317 1.6746 1.3662 1.3902 1.5389 1.3776 1.4651 1.2477 1.4379 1.2093 1.0858 1.0933 1.1016 1.0785 1.0913 1.0875 1.1231 1.0958 1.0685 8.5297 1.0630 1.0632 1.0366 1.0599 1.0655 1.0620 1.0626 1.0956 1.0994 1.1005 1.0978 1.1027 1.1024 1.0977 1.1003 1.0740 1.0641
irintensity: 0.3079 0.7818 0.8060 0.1564 0.3666 0.5266 1.7334 0.8234 1.1174 1.3413 1.5740 3.3743 18.2417 2.3315 12.0543 10.6014 29.0050 12.6689 126.9590 98.4875 8.9789 22.2834 10.3853 1.1109 5.3005 10.8723 7.1828 34.6163 4.6432 7.2598 2.2968 188.6199 26.7474 12.1053 4.8678 7.3199 1.7381 3.7303 15.6586 25.4739 36.3680 0.7774 3.6554 3.8358 4.7194 5.3477 5.0298 0.1346 2.5619 0.4424 0.7075 11.4383 7.3513 21.0036 9.6253 1.7553 20.2611 4.0410 19.8737 7.7249 5.9995 7.1800 14.9171 174.6101 36.9797 30.0948 30.7546 7.1351 58.1356 39.0038 22.7011 61.1544 60.1134 22.6039 10.8101 7.1629 65.2106 57.4055 36.7117 0.8736 22.5256
temp: 298.150 k
press: 1.00000 atm
elementType: 8 8 7 6 6 6 6 6 6 6 6 6 1 1 1 1 1 1 1 1 1 1 1 1 1 1 1 1 1
symmnumber: 1
zpe: 662418.3 jmol-1
zpe.correction: 0.252302 hartree
zpe.thermalcorrener: 0.265161 hartree
zpe.thermalcorrenthalpy: 0.266105 hartree
zpe.thermalcorrgfe: 0.213006 hartree
zpe.sumelectzpe: -557.385798 hartree
zpe.sumelectthermal: -557.372939 hartree
zpe.sumelectthermalent: -557.371995 hartree
zpe.sumelectthermalfe: -557.425094 hartree
dipole: -0.4753 0.3162 -1.1450
dipole: 1.2794
quadrupole: -69.3002 -69.1532 -79.9771
quadrupole: -1.1931 0.9932 -2.1770
quadrupole: 3.5100 3.6570 -7.1669 -1.1931 0.9932 -2.1770
hfenergy: -557.6380999 hartree
pointgroup: C01 [X(C9H17N1O2)]
dipole: -0.199271 0.0236456 0.4616397 debye
polarizability: 118.6278708|-2.2413191|102.3345537|-0.3697637|-1.3512878|101.5023415 unknown
InChI: InChI=1S/C9H17NO2/c1-2-10-9(8(11)12)6-4-3-5-7-9/h10-11H,2-7H2,1H3
charge 0 multiplicity 1
29 atoms
O  -0.811684 -1.946661 1.055341
O  -0.514917 -1.620925 -1.216912
N  -1.311882 0.953489 0.942032
C  -0.101066 0.293903 0.37706
C  0.968942 0.254941 1.508372
C  0.452963 1.079926 -0.838698
C  2.330124 -0.298743 1.032668
C  1.835487 0.566438 -1.310227
C  2.869064 0.523741 -0.161213
C  -0.454382 -1.153248 -0.056563
C  -2.437471 1.400063 0.088816
C  -3.365465 0.302524 -0.496079
H  0.583598 -0.33927 2.357833
H  1.086925 1.299753 1.855182
H  0.528272 2.139511 -0.524216
H  -0.255472 1.027408 -1.685625
H  2.22577 -1.362449 0.734583
H  3.04854 -0.277357 1.874384
H  2.199509 1.221025 -2.125503
H  1.717419 -0.444778 -1.743636
H  3.086628 1.557127 0.18047
H  3.823562 0.096808 -0.525086
H  -1.628293 0.467124 1.791474
H  -3.043813 2.088134 0.710326
H  -2.027082 2.014917 -0.731345
H  -2.82699 -0.353541 -1.201751
H  -3.788808 -0.326821 0.309478
H  -4.209253 0.766725 -1.041572
H  -1.096421 -2.842759 0.729001
