program: Gaussian 09
title: 000228210
version: EM64L-G09RevD.01
frameworkgroup: C1[X(C6H6O2)]
method: RPBEPBE
basis: SDD
operation: Freq
keyword: #p
keyword: freq=noraman
keyword: PBEPBE/SDD
title: #p freq=noraman PBEPBE/SDD
converged: NO YES NO YES
title: Mulliken charges:
elementType: O O C C C C C C H H H H H H
charge: -0.440581 -0.253766 -0.533406 0.286113 -0.219662 -0.355044 -0.222565 0.069450 0.259970 0.259922 0.243740 0.278105 0.248779 0.378945
chargesum: 0.00000
title: Mulliken charges with hydrogens summed into heavy atoms:
elementType: O O C C C C C C
charge: -0.061636 -0.253766 -0.013515 0.286113 0.024079 -0.076939 0.026214 0.069450
polarizability: 1.02618362e+02 1.49816915e-02 7.62500971e+01 -9.03645567e-03 4.45459139e-03 3.24198868e+01
1716.lowfreq: -5.6575 -0.0010 -0.0007 0.0006 12.6299 13.0194 85.7950 171.1456 180.4889
frequency: 85.7380 171.1442 180.4885 354.0649 391.4534 482.9003 515.6040 581.8610 632.0222 687.1540 712.6133 811.5710 863.2855 894.2881 924.4593 959.1294 966.1152 1009.2531 1019.8382 1088.2487 1102.3352 1152.4948 1229.4771 1275.6261 1333.7430 1362.8967 1384.0782 1506.3328 1586.1486 1638.9565 2994.8479 3037.2816 3170.0840 3185.6780 3204.9274 3527.2815
redmass: 5.1514 3.9613 5.0555 1.5813 6.8128 6.3705 2.4400 1.1906 4.5041 2.5596 1.5864 6.0374 4.5674 2.0614 1.3964 1.4015 1.7361 3.8357 1.6060 1.1414 1.2203 1.7277 1.4232 2.0857 5.3989 2.2081 1.1416 5.7118 6.0541 8.1953 1.0627 1.0957 1.0878 1.0968 1.1081 1.0641
irintensity: 0.5140 0.5049 0.2200 28.4021 16.0071 5.5098 4.0724 83.1017 23.3305 130.5239 15.6020 14.4214 22.9997 14.6950 10.4347 0.6763 29.3977 270.1643 7.4543 0.5818 1.0740 112.6828 2.5733 34.3568 65.8570 5.0725 37.1783 61.3733 31.4547 348.7856 0.3437 3.3195 3.0670 5.5542 12.3501 38.7398
temp: 298.150 k
press: 1.00000 atm
elementType: 8 8 6 6 6 6 6 6 1 1 1 1 1 1
symmnumber: 1
zpe: 275281.2 jmol-1
zpe.correction: 0.104849 hartree
zpe.thermalcorrener: 0.111839 hartree
zpe.thermalcorrenthalpy: 0.112783 hartree
zpe.thermalcorrgfe: 0.073401 hartree
zpe.sumelectzpe: -382.083224 hartree
zpe.sumelectthermal: -382.076234 hartree
zpe.sumelectthermalent: -382.075290 hartree
zpe.sumelectthermalfe: -382.114672 hartree
dipole: 2.0912 -1.8308 -0.0006
dipole: 2.7794
quadrupole: -40.8818 -45.5729 -47.8534
quadrupole: 5.4599 0.0027 0.0013
quadrupole: 3.8875 -0.8035 -3.0840 5.4599 0.0027 0.0013
hfenergy: -382.1880729 hartree
pointgroup: C01 [X(C6H6O2)]
dipole: -0.8457816 -0.6931117 0.0002544 debye
dipolederiv: -0.6082358 0.4230303 -0.0000244 0.5996765 -1.039009 0.0000974 -0.0005737 0.0009492 -0.4319063 -1.0540503 -0.2964391 0.0004213 -0.3343927 -0.8131992 0.0006467 -0.0006271 -0.0004896 -0.3407106 -0.0711093 0.0777832 0.0000864 0.0632479 -0.3116941 0.0000155 0.0002741 0.000051 0.1470485 -1.0131933 0.0715453 0.0000938 0.3560904 0.1127195 -0.0000989 0.0003671 -0.0000567 -0.0923559 -0.1398553 -0.0962818 -0.0000738 0.0824518 0.1879409 -0.000039 0.000014 0.0000408 -0.2133862 0.4381646 0.1943759 -0.0001957 -0.0262487 0.0609894 0.0000019 0.0001038 -0.0000927 -0.0994033 -0.0220439 -0.1758434 -0.0000649 -0.3909418 -0.1800952 0.0001383 -0.000069 0.0000906 -0.1892243 2.0641594 -0.1278566 -0.0002526 -0.1892402 1.4108284 -0.0008074 0.0005823 -0.0004751 0.2298082 0.1172346 0.0215107 -0.0252055 0.0106346 0.0951048 0.0849633 -0.0178629 0.0958554 0.0269202 0.1172927 0.0214369 0.02517 0.0106198 0.0950322 -0.0849966 0.0178045 -0.0959289 0.0268418 -0.0405875 -0.0716858 0.0000749 -0.0774941 0.0584562 0.0000406 0.0000454 0.000014 0.1708271 0.089037 -0.0587216 0.0000332 -0.0462521 -0.0069956 0.0000252 0.0000311 0.0000502 0.1812201 -0.0394666 0.0885212 0.0000629 0.0972773 0.0335141 -0.0000366 0.0000114 -0.0000526 0.1905791 0.1626537 -0.0713754 -0.0001254 -0.1554286 0.2964076 0.0000498 -0.0001008 0.0000444 0.3937417 unknown
polarizability: 102.5893759|-0.873905|76.2790836|-0.0091768|-0.0041577|32.4198868 unknown
InChI: InChI=1S/C6H6O2/c7-6(8)5-3-1-2-4-5/h1-3,7H,4H2
charge 0 multiplicity 1
14 atoms
O  2.059905 -1.257386 0.000375
O  2.279467 1.064709 -0.000208
C  -0.813503 -1.195341 -0.000108
C  0.065241 0.038575 -0.00058
C  -2.213692 -0.624412 0.000422
C  -0.740003 1.164181 -0.000177
C  -2.147314 0.753882 0.000315
C  1.527785 0.054622 -0.0013
H  -0.620709 -1.838161 0.882061
H  -0.621442 -1.838257 -0.882367
H  -3.120611 -1.234459 0.000775
H  -0.37375 2.193962 -0.000356
H  -2.994058 1.444176 0.000581
H  3.052384 -1.188791 0.001165
