program: Gaussian 09
title: 000228205
version: EM64L-G09RevD.01
frameworkgroup: C1[X(C12H19NO3)]
method: RPBEPBE
basis: SDD
operation: Freq
keyword: #p
keyword: freq=noraman
keyword: PBEPBE/SDD
title: #p freq=noraman PBEPBE/SDD
converged: NO YES NO NO
title: Mulliken charges:
elementType: O O O N C C C C C C C C C C C C H H H H H H H H H H H H H H H H H H H
charge: -0.302413 -0.305464 -0.294283 -0.378086 0.264641 -0.488883 -0.466356 -0.403151 -0.404728 -0.387635 0.216874 -0.258314 -0.319956 -0.537946 0.317824 -0.607693 0.227073 0.216565 0.216167 0.214962 0.217263 0.202318 0.200843 0.216369 0.188802 0.204312 0.225071 0.211086 0.241681 0.234160 0.284900 0.326979 0.270763 0.228841 0.227414
chargesum: 0.00000
title: Mulliken charges with hydrogens summed into heavy atoms:
elementType: O O O N C C C C C C C C C C C C
charge: -0.302413 -0.305464 -0.294283 -0.051107 0.264641 -0.045245 -0.035227 0.016430 0.012483 0.005479 0.216874 0.177844 0.155886 -0.253046 0.317824 0.119324
polarizability: 1.74343307e+02 2.58300226e-01 1.33584359e+02 -8.56583493e+00 1.06996466e+01 1.22115754e+02
1716.lowfreq: -15.4646 -1.0187 -0.0007 -0.0005 -0.0003 7.5939 16.2708 25.8604 39.3690
frequency: 7.9238 25.5585 39.3023 52.4553 95.0818 102.3505 104.5997 118.4984 130.9834 158.7060 197.2599 215.5185 226.3342 239.3274 275.1514 311.6776 328.1523 378.9320 398.1806 417.6264 445.2045 504.4920 532.0566 547.8372 576.9135 628.4336 630.1321 635.7242 662.6803 670.3261 697.7520 788.4830 816.7383 821.5226 842.7267 854.8518 893.4042 913.6975 939.4584 942.3626 974.8050 997.4489 1022.0144 1048.1114 1067.0763 1081.3824 1097.2184 1113.6263 1122.1099 1126.6589 1135.4109 1145.9473 1164.0636 1199.8304 1205.6592 1214.6940 1251.2049 1265.2987 1277.4532 1280.6290 1306.5899 1323.2163 1328.3508 1337.7838 1344.2744 1353.7301 1383.9824 1429.2481 1454.0977 1460.5769 1462.5282 1464.3755 1465.5899 1473.6751 1479.7342 1484.4548 1491.4637 1518.1884 1679.6792 2119.5692 2970.4012 2971.0684 2977.6799 2980.0304 2982.0360 2988.8572 2998.4668 3033.5479 3033.9671 3037.6543 3042.8963 3046.4074 3054.2951 3057.4077 3070.5115 3111.1897 3124.7236 3425.2603 3577.7339
redmass: 4.2225 4.3682 3.9847 3.7976 3.8711 3.2604 1.1624 2.7522 3.2159 3.5244 3.5671 3.9302 3.4997 2.0634 4.3543 2.2929 4.1380 2.9265 3.9378 2.9878 3.7253 1.8610 5.2373 4.4313 1.1133 1.2240 4.6512 3.5000 1.2578 5.0789 12.1494 1.4414 1.2564 2.1368 2.0930 3.0479 2.7784 2.3545 1.5144 1.9435 6.1160 3.8541 4.7455 1.8977 1.7123 2.4266 1.5146 4.1645 1.6073 1.2850 1.7646 1.7597 2.3515 1.2527 2.2006 1.8736 1.3320 1.2472 1.1624 1.5397 1.3772 1.2540 1.3729 1.3716 1.4527 1.4636 1.3469 1.1635 1.1324 1.0847 1.0894 1.2413 1.0853 1.0809 1.0917 1.0447 1.0802 1.4393 8.5783 6.0396 1.0624 1.0547 1.0355 1.0618 1.0618 1.0616 1.0629 1.0960 1.1056 1.1003 1.0594 1.1017 1.1026 1.1031 1.1022 1.0980 1.1085 1.1582 1.0772
irintensity: 1.9822 1.1590 2.8053 4.5118 1.7034 0.2185 0.4047 1.2532 0.6115 2.2700 0.5287 6.3016 1.3412 1.7558 8.8193 0.2331 33.0097 3.4642 12.0119 1.6582 3.3046 4.9365 4.2098 3.2038 134.6405 68.7965 12.1782 1.4918 60.0552 0.4149 27.1085 1.8039 4.9323 1.9428 11.5409 13.1044 10.8786 17.5024 3.5314 6.2922 62.1511 48.1995 197.6305 6.6771 6.3013 34.9768 0.2356 202.4083 12.7502 0.2050 2.7038 13.0241 10.6373 32.6139 205.4230 6.5849 3.3629 2.1149 4.0914 19.7481 0.6859 2.8230 10.8371 0.2142 0.3982 2.0978 2.5054 30.9815 16.3550 1.8292 6.0689 126.1109 17.0635 16.1088 2.8744 15.2281 9.6544 171.7209 269.2259 0.4453 37.8881 24.7381 84.2016 27.7959 31.2501 20.3612 18.8274 54.2281 17.7227 61.6263 24.0681 48.4873 39.4041 38.8923 38.8823 4.0382 13.5051 59.0940 37.5314
temp: 298.150 k
press: 1.00000 atm
elementType: 8 8 8 7 6 6 6 6 6 6 6 6 6 6 6 6 1 1 1 1 1 1 1 1 1 1 1 1 1 1 1 1 1 1 1
symmnumber: 1
zpe: 770420.8 jmol-1
zpe.correction: 0.293438 hartree
zpe.thermalcorrener: 0.311273 hartree
zpe.thermalcorrenthalpy: 0.312217 hartree
zpe.thermalcorrgfe: 0.244654 hartree
zpe.sumelectzpe: -747.777977 hartree
zpe.sumelectthermal: -747.760142 hartree
zpe.sumelectthermalent: -747.759198 hartree
zpe.sumelectthermalfe: -747.826761 hartree
dipole: -0.7631 1.1834 2.0456
dipole: 2.4834
quadrupole: -73.7113 -96.6583 -94.4012
quadrupole: -6.7911 -6.2418 1.2611
quadrupole: 14.5456 -8.4014 -6.1443 -6.7911 -6.2418 1.2611
hfenergy: -748.0714145 hartree
pointgroup: C01 [X(C12H19N1O3)]
dipole: 0.2469556 0.6542624 -0.6823179 debye
polarizability: 172.8382725|1.6949493|138.0776074|-12.2589975|-6.793223|119.1275407 unknown
InChI: InChI=1S/C12H19NO3/c1-3-12(7-5-4-6-8-12)16-10-9-15-11(14)13-2/h1,13H,4-10H2,2H3
charge 0 multiplicity 1
35 atoms
O  -0.602725 0.244129 1.175286
O  2.99237 0.948376 0.622037
O  3.401076 -1.312925 0.053421
N  4.864555 0.431213 -0.548704
C  -1.92183 0.278604 0.477727
C  -2.945097 0.134579 1.635744
C  -2.063554 -0.916552 -0.509867
C  -4.394477 -0.012233 1.12006
C  -3.514208 -1.064339 -1.030538
C  -4.523572 -1.197747 0.134836
C  -2.093015 1.575534 -0.224646
C  0.5841 0.453723 0.330783
C  1.751504 0.538544 1.321678
C  -2.210964 2.662415 -0.79592
C  3.736186 -0.100225 0.032022
C  5.849839 -0.401331 -1.241481
H  -2.84745 1.003676 2.310149
H  -2.650646 -0.766227 2.208399
H  -1.765182 -1.828208 0.044564
H  -1.368306 -0.796925 -1.361125
H  -4.704915 0.924474 0.615724
H  -5.074679 -0.15266 1.981657
H  -3.573345 -1.946523 -1.696442
H  -3.774537 -0.179697 -1.645431
H  -4.332182 -2.146841 0.677164
H  -5.555559 -1.255216 -0.26124
H  0.735564 -0.39084 -0.369114
H  0.495811 1.399927 -0.23996
H  1.908325 -0.432009 1.822043
H  1.570115 1.331271 2.063434
H  -2.321665 3.609562 -1.291366
H  5.00088 1.438758 -0.466232
H  5.490863 -1.442438 -1.21434
H  6.837191 -0.355887 -0.745063
H  5.96573 -0.093464 -2.297258
