program: Gaussian 09
title: 000228201
version: EM64L-G09RevD.01
frameworkgroup: C1[X(C19H29NO4)]
method: RPBEPBE
basis: SDD
operation: Freq
keyword: #p
keyword: freq=noraman
keyword: PBEPBE/SDD
title: #p freq=noraman PBEPBE/SDD
converged: YES YES NO NO
title: Mulliken charges:
elementType: O O O O N C C C C C C C C C C C C C C C C C C C H H H H H H H H H H H H H H H H H H H H H H H H H H H H H
charge: -0.220194 -0.211155 -0.301635 -0.292207 -0.151382 -0.266839 -0.258899 -0.241862 -0.251619 -0.535407 -0.224831 -0.221705 0.164784 0.117877 -0.374229 -0.391416 -0.218441 -0.258188 -0.250523 -0.015272 -0.393773 -0.275607 -0.708867 -0.720220 0.282812 0.283478 0.256844 0.271314 0.241293 0.283646 0.245368 0.245061 0.238397 0.235012 0.200655 0.249028 0.196403 0.193325 0.198946 0.217166 0.227962 0.205560 0.191494 0.184207 0.210390 0.193665 0.189889 0.214444 0.212333 0.199915 0.213210 0.218839 0.200954
chargesum: 0.00000
title: Mulliken charges with hydrogens summed into heavy atoms:
elementType: O O O O N C C C C C C C C C C C C C C C C C C C
charge: -0.220194 -0.211155 -0.301635 -0.292207 -0.151382 0.015973 0.024579 0.014982 0.019695 -0.010469 0.020537 0.023356 0.164784 0.117877 0.099180 0.058267 0.171287 0.157923 0.146530 0.212690 0.000824 0.107947 -0.082175 -0.087216
polarizability: 2.30128298e+02 4.70316724e+00 2.23597681e+02 1.90533233e+01 -1.15256787e-01 1.88089203e+02
1716.lowfreq: -30.1084 -5.7010 -4.5964 -0.0008 -0.0001 0.0007 7.8398 12.3991 22.8193
frequency: -28.6771 7.3050 22.2714 28.6995 33.7711 48.7685 64.5055 74.9017 80.9284 100.8529 104.9633 127.7484 149.3736 156.8136 181.9319 193.1529 200.9689 216.0868 231.4399 240.3811 263.4465 273.9947 310.3385 327.2396 339.5545 362.3983 381.6191 405.1325 418.1914 418.5607 445.2666 495.1510 502.0564 507.3287 547.1150 578.5174 620.8610 633.2369 678.5505 720.6180 744.0146 760.1445 761.3413 786.9533 802.6671 803.3987 823.5813 837.5742 867.3429 879.9438 900.5945 902.4879 905.1518 911.8587 912.2227 916.7183 929.4501 934.2553 952.7328 953.1850 988.2325 998.9510 1000.9392 1007.1523 1009.6785 1025.0571 1026.5411 1030.4201 1069.6392 1081.1933 1089.2747 1099.6675 1101.8183 1104.4970 1113.2459 1122.1494 1137.0001 1142.3804 1149.3310 1156.2689 1166.8424 1175.0397 1183.3411 1208.6793 1214.5078 1222.1024 1230.1039 1243.9724 1250.9030 1252.9028 1258.3385 1259.7927 1268.3417 1271.1972 1281.9981 1303.1668 1313.7282 1320.9500 1330.9813 1339.7961 1341.3041 1353.2713 1355.0921 1366.1033 1373.1813 1377.0085 1391.5707 1393.0779 1421.8737 1442.8477 1444.8999 1448.0259 1465.3321 1470.1397 1474.0028 1477.4271 1481.4557 1485.7176 1490.8957 1494.5716 1498.3483 1577.8618 1618.7861 1683.4126 2917.4438 2922.6129 2937.9471 2948.1419 2959.8181 2962.5649 2967.4412 2973.8920 2974.3585 2986.5189 2997.2856 3000.0621 3012.7593 3018.8109 3023.2006 3034.6704 3053.5583 3056.7220 3062.1873 3064.5533 3066.7863 3068.7877 3070.9199 3079.3369 3095.0581 3098.5859 3104.2128 3157.8385 3190.2377
redmass: 2.4277 3.7502 3.8594 4.6970 3.7543 4.3609 5.4695 3.4558 2.6486 3.9936 3.3652 5.0553 4.6993 4.2103 2.1679 3.2233 1.5971 1.6487 1.8391 3.6831 2.1014 2.8064 5.0062 2.1548 4.0502 2.2083 3.1225 2.0854 3.7806 3.1065 3.4730 2.4531 1.9727 3.8558 2.7644 7.0425 4.6316 3.8271 5.2419 1.8518 3.6356 2.3031 4.1268 5.0991 2.6487 4.4215 1.7246 1.4172 1.8015 2.8409 2.2638 2.5984 2.5171 1.6259 1.3561 1.8976 1.5931 2.2025 1.5982 2.3747 2.7776 1.8974 1.8039 2.3279 1.6367 2.7734 2.1786 2.4656 4.0412 4.4219 1.2417 1.5548 2.1580 1.9474 1.7919 2.1836 1.7386 2.0051 2.0978 1.6015 1.8621 1.6292 1.2482 1.2121 1.3189 1.2725 1.4645 1.5478 1.3137 1.2559 1.3035 1.3902 1.3510 1.5554 1.6091 1.2289 1.1975 1.6821 1.5908 1.4029 3.8537 1.3733 1.4121 1.4171 1.2228 1.3628 1.2406 1.3795 1.5012 1.0908 1.0874 1.1032 1.0503 1.0624 1.0813 1.0681 1.0609 1.0662 1.0759 1.0887 1.0796 5.6857 12.1547 11.2651 1.0550 1.0563 1.0561 1.0564 1.0893 1.0359 1.0414 1.0992 1.0750 1.1023 1.0825 1.0654 1.0602 1.1086 1.0604 1.1003 1.0988 1.0855 1.0994 1.0987 1.0990 1.0870 1.0983 1.1039 1.0896 1.1035 1.0953 1.0874 1.1097
irintensity: 0.0059 0.0219 0.0597 0.0079 0.8485 0.2926 3.0291 3.3993 0.1656 0.4766 2.2308 0.2311 2.6518 25.1877 0.9511 0.7344 0.6561 0.7567 1.5036 0.3145 0.3719 1.6841 8.9440 3.7382 3.8765 1.2258 10.8620 0.6379 1.8256 2.2938 1.1365 0.5357 2.2801 0.3324 2.3825 5.4796 6.8925 19.0673 1.9129 36.3084 15.7742 0.6580 13.0756 1.9069 12.8592 0.5466 4.7138 6.7489 33.0783 14.2484 5.1726 8.1171 3.3598 3.9783 2.5996 0.1029 1.3972 9.3228 1.2557 0.7050 24.1117 4.6293 3.4936 20.9939 4.2504 18.0969 39.1181 71.4946 20.2684 177.5182 3.3149 5.8700 15.8697 15.8314 1.1649 8.5150 17.5750 6.9978 6.2848 2.1652 59.9188 20.3878 18.4342 3.7984 19.1803 0.1393 17.0708 1.9901 5.9872 7.6362 0.1651 1.0488 0.9704 2.1229 4.0687 0.8942 19.9573 15.2950 36.3086 1.2841 150.5100 0.0319 2.8898 14.8974 19.4516 22.4868 12.0014 10.6912 0.3854 31.1061 5.9801 23.7559 2.4681 2.6711 0.9743 16.0633 7.9102 14.3545 15.4268 20.7535 3.0419 4.5927 511.0181 34.8784 39.6330 58.2411 52.3748 106.4901 18.7905 40.0497 48.5764 22.9605 70.7707 12.0292 9.6715 39.0441 32.3535 80.0860 11.3648 31.7158 11.3616 3.5536 23.1371 73.9718 58.1715 18.4234 67.2847 7.7761 29.7634 15.5894 10.2397 4.9697 22.1443
temp: 298.150 k
press: 1.00000 atm
elementType: 8 8 8 8 7 6 6 6 6 6 6 6 6 6 6 6 6 6 6 6 6 6 6 6 1 1 1 1 1 1 1 1 1 1 1 1 1 1 1 1 1 1 1 1 1 1 1 1 1 1 1 1 1
symmnumber: 1
zpe: 1184675.7 jmol-1
zpe.correction: 0.451219 hartree
zpe.thermalcorrener: 0.475242 hartree
zpe.thermalcorrenthalpy: 0.476187 hartree
zpe.thermalcorrgfe: 0.394013 hartree
zpe.sumelectzpe: -1095.166943 hartree
zpe.sumelectthermal: -1095.142920 hartree
zpe.sumelectthermalent: -1095.141976 hartree
zpe.sumelectthermalfe: -1095.224149 hartree
dipole: 0.7218 1.0835 0.0689
dipole: 1.3037
quadrupole: -150.4188 -128.0821 -155.5757
quadrupole: -0.6251 -8.2759 2.4148
quadrupole: -5.7266 16.6101 -10.8835 -0.6251 -8.2759 2.4148
hfenergy: -1095.6181625 hartree
pointgroup: C01 [X(C19H29N1O4)]
dipole: 0.2211195 0.46268 -0.0107943 debye
polarizability: 224.9569996|7.9262457|225.1610859|21.4799155|-1.3156383|191.697097 unknown
InChI: InChI=1S/C19H29NO4/c1-13(2)6-9-24-11-10-23-8-3-7-20-18(21)16-14-4-5-15(12-14)17(16)19(20)22/h4-5,13-17H,3,6-12H2,1-2H3
charge 0 multiplicity 1
53 atoms
O  -1.885543 -0.896958 2.192906
O  -3.958259 -1.484329 -1.968797
O  0.294659 -1.788055 -0.153209
O  3.287509 0.22099 0.567653
N  -2.868072 -1.4850 0.124624
C  -2.853326 0.840059 0.669956
C  -3.555656 0.645073 -0.712444
C  -1.61923 1.774339 0.314231
C  -2.647077 1.49029 -1.703277
C  -1.235154 1.218922 -1.094782
C  -2.239941 3.123473 -0.077462
C  -2.854108 2.953929 -1.285301
C  -2.454858 -0.568245 1.123554
C  -3.5087 -0.861939 -0.974295
C  -2.690655 -2.943468 0.218657
C  -1.434998 -3.489254 -0.500097
C  -0.098052 -3.166966 0.176471
C  1.545876 -1.42198 0.526053
C  1.946298 -0.030054 0.038998
C  6.23356 0.705327 0.229242
C  5.195256 1.705315 0.805121
C  3.781084 1.565667 0.231934
C  7.56248 0.812704 1.013404
C  6.477211 0.922804 -1.283231
H  -3.485616 1.302078 1.445265
H  -4.603552 0.984592 -0.74735
H  -0.845229 1.788161 1.095035
H  -2.808077 1.243934 -2.762293
H  -0.454441 1.826848 -1.580941
H  -0.931334 0.157902 -1.088761
H  -2.251576 4.0127 0.558371
H  -3.465507 3.677626 -1.830742
H  -3.590278 -3.400223 -0.23159
H  -2.65542 -3.194862 1.294353
H  -1.542099 -4.5914 -0.538778
H  -1.412884 -3.133816 -1.546415
H  -0.177601 -3.280051 1.280221
H  0.691059 -3.861065 -0.190252
H  2.350888 -2.143771 0.268277
H  1.400932 -1.426869 1.626011
H  5.821459 -0.313176 0.372164
H  1.231803 0.736012 0.407498
H  1.94726 -0.004186 -1.072823
H  5.544497 2.743429 0.622198
H  5.134299 1.573029 1.903353
H  3.104114 2.330394 0.67534
H  3.772614 1.702632 -0.872474
H  7.409128 0.620757 2.092047
H  8.305792 0.083156 0.641094
H  8.002367 1.824324 0.908549
H  7.234277 0.212043 -1.663693
H  5.55688 0.773886 -1.876894
H  6.849142 1.948069 -1.478678
