program: Gaussian 09
title: 000228181
version: EM64L-G09RevD.01
frameworkgroup: C1[X(C13H23NO)]
method: RPBEPBE
basis: SDD
operation: Freq
keyword: #p
keyword: freq=noraman
keyword: PBEPBE/SDD
title: #p freq=noraman PBEPBE/SDD
converged: YES YES NO NO
title: Mulliken charges:
elementType: O N C C C C C C C C C C C C C H H H H H H H H H H H H H H H H H H H H H H H
charge: -0.449217 -0.092894 -0.090979 -0.156667 0.151152 -0.458926 -0.459000 -0.449139 -0.449103 -0.400847 -0.400868 -0.401374 -0.401732 -0.385489 -0.385053 0.190122 0.262807 0.222867 0.204348 0.204927 0.222711 0.189826 0.215150 0.215083 0.190024 0.199874 0.189141 0.189165 0.199926 0.199521 0.197370 0.197395 0.199518 0.198383 0.192174 0.200489 0.186862 0.362453
chargesum: 0.00000
title: Mulliken charges with hydrogens summed into heavy atoms:
elementType: O N C C C C C C C C C C C C C
charge: -0.086764 -0.092894 0.099144 0.106140 0.151152 -0.031711 -0.031362 -0.044163 -0.043996 -0.011832 -0.011778 -0.004482 -0.004820 0.005068 0.002299
polarizability: 1.64089503e+02 8.84288305e-01 1.48373325e+02 -2.64448977e-02 -6.68247345e-02 1.27649417e+02
1716.lowfreq: -0.0006 0.0003 0.0005 14.8940 15.1197 19.9701 30.2198 60.6319 65.7492
frequency: 20.0200 57.8874 65.7487 111.9785 115.0563 190.6746 192.1842 199.1630 223.4589 230.2717 274.5926 318.5787 323.4877 346.8163 396.9683 414.6560 429.7408 431.8472 432.0914 485.6259 487.4909 550.1728 649.3335 661.4838 749.8966 784.5668 786.0133 794.2423 828.9966 844.1345 851.6981 886.6802 887.9864 896.4700 898.7107 915.2811 916.4905 925.3127 978.8846 1015.9483 1047.7298 1048.8447 1053.7380 1054.3666 1068.7568 1075.1094 1111.6894 1116.1691 1122.2887 1138.1371 1172.0889 1182.5047 1182.9621 1229.3718 1238.8546 1253.3498 1258.0070 1261.8989 1263.2248 1276.2348 1294.1678 1299.2824 1308.9620 1318.2011 1331.3010 1334.1189 1337.0845 1338.9712 1344.2640 1344.8517 1347.4977 1348.4358 1352.3364 1367.8639 1459.1973 1459.6173 1461.8322 1463.2406 1463.3881 1464.9612 1466.6528 1471.5359 1474.9385 1478.8714 1595.8812 2959.0843 2959.7895 2962.1566 2965.4243 2966.0654 2966.8138 2968.3315 2970.0147 2971.0022 2979.7286 2982.4532 3014.0298 3020.5438 3024.2801 3025.3910 3027.9477 3032.1397 3034.8799 3035.4997 3040.8209 3047.5620 3050.1202 3566.5570
redmass: 3.1616 3.0702 3.4831 3.2222 3.8338 4.3700 3.0894 3.3494 1.7927 1.7625 3.6208 4.8927 1.8333 1.8634 3.3140 1.2069 2.9808 2.5997 2.6842 1.6789 1.5481 3.2332 3.4197 7.4566 2.6403 1.4515 1.4530 2.4342 3.4069 2.0444 1.7312 2.0416 1.6167 1.5112 2.4977 1.7374 2.9193 1.9995 2.3236 2.4881 1.3540 1.8328 1.5431 1.7355 1.2669 1.1479 2.3491 2.4416 2.2546 2.3154 1.4204 1.9158 1.5798 1.4103 1.3476 1.3012 1.2510 1.2605 1.2998 1.4164 1.4067 1.2334 1.3243 1.3274 1.4124 1.3861 1.3595 1.4794 1.3274 1.5744 1.4178 1.4504 1.4874 1.4360 1.0875 1.0870 1.0880 1.0901 1.0884 1.0882 1.0831 1.0826 1.0932 1.0956 6.4246 1.0637 1.0646 1.0757 1.0615 1.0614 1.0633 1.0625 1.0617 1.0669 1.0608 1.0623 1.0852 1.0979 1.0939 1.0976 1.0946 1.1034 1.1005 1.1033 1.1031 1.1015 1.1019 1.0673
irintensity: 0.0468 0.0118 0.1450 0.1886 0.0726 0.5660 0.2326 0.4305 0.0001 0.0498 1.1837 8.6568 0.3538 1.0393 0.7142 124.6524 0.8598 2.4629 4.8784 1.4589 1.6054 4.0571 35.6985 0.3181 10.7453 0.0192 0.2073 6.2248 12.7783 10.8862 9.3177 26.7203 3.3803 22.2201 23.1670 0.2513 42.6735 0.4100 27.8742 3.6777 0.1311 0.0107 0.0270 0.6199 0.0116 0.0211 0.0054 0.0259 2.5952 3.7666 0.1244 30.3726 5.4293 13.8602 24.8338 1.6379 0.8664 0.6413 4.8674 22.1995 14.2170 0.7038 0.2022 0.0241 1.4522 0.2093 0.3367 0.7652 0.0937 0.1861 0.0697 0.7787 0.6298 0.3714 1.9134 3.0118 4.0013 14.7864 15.9996 1.0726 12.1670 28.3662 1.6019 4.1663 10.3459 29.9206 30.3999 48.8746 7.6336 34.4237 24.4366 64.2490 40.6190 6.8346 39.1166 16.7407 20.4781 69.2534 68.1655 94.4715 55.9425 30.2329 9.4380 2.3307 6.1183 95.4805 135.8245 33.3034
temp: 298.150 k
press: 1.00000 atm
elementType: 8 7 6 6 6 6 6 6 6 6 6 6 6 6 6 1 1 1 1 1 1 1 1 1 1 1 1 1 1 1 1 1 1 1 1 1 1 1
symmnumber: 1
zpe: 892558.1 jmol-1
zpe.correction: 0.339957 hartree
zpe.thermalcorrener: 0.355059 hartree
zpe.thermalcorrenthalpy: 0.356003 hartree
zpe.thermalcorrgfe: 0.297440 hartree
zpe.sumelectzpe: -637.911462 hartree
zpe.sumelectthermal: -637.896360 hartree
zpe.sumelectthermalent: -637.895416 hartree
zpe.sumelectthermalfe: -637.953979 hartree
dipole: 0.1381 -0.8971 -0.0006
dipole: 0.9077
quadrupole: -92.2835 -89.1551 -93.4449
quadrupole: -0.8659 0.0149 -0.0480
quadrupole: -0.6557 2.4727 -1.8170 -0.8659 0.0149 -0.0480
hfenergy: -638.251419 hartree
pointgroup: C01 [X(C13H23N1O1)]
dipole: -0.0536318 0.3530626 -0.0003471 debye
polarizability: 164.0929483|0.852695|148.3698627|0.0474137|0.0632|127.649434 unknown
InChI: InChI=1S/C13H23NO/c15-14-13(11-7-3-1-4-8-11)12-9-5-2-6-10-12/h11-12,15H,1-10H2
charge 0 multiplicity 1
38 atoms
O  -0.765768 -3.143411 -0.017474
N  0.382654 -2.204208 -0.007075
C  1.135525 0.072955 0.007407
C  -1.456799 -0.475201 -0.000285
C  -0.009491 -0.947709 0.00133
C  2.024291 -0.055903 1.279077
C  2.011651 -0.030919 -1.275283
C  -1.794255 0.339251 1.283927
C  -1.785872 0.354152 -1.277171
C  3.166641 0.986474 1.281294
C  3.153745 1.011656 -1.269061
C  -3.269064 0.807932 1.276153
C  -3.260731 0.822675 -1.273698
C  4.028756 0.88443 0.000629
C  -3.59604 1.626429 0.00485
H  0.680143 1.085203 0.019701
H  -2.103824 -1.373485 -0.00761
H  2.444005 -1.080052 1.307266
H  1.398736 0.058447 2.186117
H  1.377305 0.10021 -2.173858
H  2.431535 -1.054111 -1.326821
H  -1.132818 1.227476 1.351234
H  -1.595432 -0.28133 2.178557
H  -1.58105 -0.255913 -2.177643
H  -1.124093 1.243198 -1.329753
H  3.797789 0.8492 2.181046
H  2.734402 2.007173 1.34819
H  2.720817 2.033417 -1.311506
H  3.775739 0.892232 -2.177692
H  -3.476885 1.407673 2.183745
H  -3.933642 -0.079487 1.318884
H  -3.92497 -0.064161 -1.331019
H  -3.462626 1.432949 -2.175597
H  4.815483 1.663782 0.004479
H  4.546458 -0.096926 -0.011709
H  -4.663168 1.921764 0.003091
H  -3.002286 2.56439 0.012134
H  -0.298259 -4.017552 -0.023057
