program: Gaussian 09
title: 000228174
version: EM64L-G09RevD.01
frameworkgroup: C1[X(C7H11NO)]
method: RPBEPBE
basis: SDD
operation: Freq
keyword: #p
keyword: freq=noraman
keyword: PBEPBE/SDD
title: #p freq=noraman PBEPBE/SDD
converged: YES YES NO NO
title: Mulliken charges:
elementType: O N C C C C C C C H H H H H H H H H H H
charge: -0.289371 -0.384897 -0.421723 0.262117 -0.355183 -0.045140 -0.065405 -0.738625 -0.570625 0.219526 0.261452 0.293070 0.212394 0.238440 0.257133 0.233281 0.224434 0.233212 0.219466 0.216444
chargesum: 0.00000
title: Mulliken charges with hydrogens summed into heavy atoms:
elementType: O N C C C C C C C
charge: -0.289371 -0.091826 0.059256 0.262117 -0.142790 0.193299 0.191728 -0.047699 -0.134714
polarizability: 1.52285413e+02 1.15161357e+01 7.11678737e+01 9.09777888e+00 3.05596549e+00 5.67277849e+01
1716.lowfreq: -11.4593 -4.3284 -0.0005 0.0004 0.0004 7.4193 38.4477 63.6581 82.1020
frequency: 38.3531 63.6412 82.0860 126.5770 151.7067 199.1266 209.7790 264.0233 332.1586 362.3672 390.3685 483.0931 564.0462 654.6073 670.9645 704.1186 836.0104 882.4598 904.4445 948.0995 953.3801 978.7886 997.5804 1015.4954 1053.8389 1065.0258 1117.4102 1142.2674 1196.4547 1240.6941 1279.4567 1284.7933 1311.7805 1338.3207 1394.4512 1426.6437 1458.1994 1464.1202 1467.2342 1479.0950 1594.0138 1656.1201 1677.2772 2968.4619 2979.5286 3041.3555 3042.0064 3080.0500 3086.4447 3092.8148 3105.7550 3110.3034 3197.9818 3548.4854
redmass: 3.1684 3.9120 2.3457 1.6011 2.7740 1.4585 2.7657 4.2955 3.5462 2.7007 3.1694 2.0179 1.1711 1.7194 2.8874 4.3069 2.0590 1.9248 1.6759 1.5569 1.7304 1.0711 1.4228 1.8008 1.5892 2.7144 2.4600 1.9824 1.7822 1.2251 1.2465 1.3472 1.3816 1.4081 1.2329 1.1999 1.0472 1.1868 1.0771 1.6861 6.6793 4.6015 5.8615 1.0369 1.0602 1.1002 1.0959 1.0976 1.0602 1.0935 1.0947 1.0900 1.1141 1.0777
irintensity: 0.8918 3.3785 2.2472 0.8620 1.8649 0.3683 1.3435 10.1691 0.5052 9.6534 2.0550 6.1227 121.4587 18.7144 2.8071 0.9430 8.2276 0.4659 28.5264 61.4060 47.5452 66.8749 11.1949 16.1196 0.1982 2.9054 12.2723 4.4353 86.7594 70.5714 0.5301 37.5021 12.0942 19.5880 12.7171 18.6466 15.7408 28.6583 50.7778 214.5498 145.6038 18.4683 79.1343 25.5683 49.4237 8.8053 20.5333 17.0946 13.0327 12.6857 10.2412 18.6040 26.4332 19.3070
temp: 298.150 k
press: 1.00000 atm
elementType: 8 7 6 6 6 6 6 6 6 1 1 1 1 1 1 1 1 1 1 1
symmnumber: 1
zpe: 434924.3 jmol-1
zpe.correction: 0.165654 hartree
zpe.thermalcorrener: 0.176260 hartree
zpe.thermalcorrenthalpy: 0.177204 hartree
zpe.thermalcorrgfe: 0.128658 hartree
zpe.sumelectzpe: -402.593995 hartree
zpe.sumelectthermal: -402.583389 hartree
zpe.sumelectthermalent: -402.582445 hartree
zpe.sumelectthermalfe: -402.630991 hartree
dipole: 0.1929 -3.5781 -0.7445
dipole: 3.6599
quadrupole: -43.1364 -58.7372 -54.3788
quadrupole: -1.0012 1.4504 -0.0937
quadrupole: 8.9477 -6.6531 -2.2946 -1.0012 1.4504 -0.0937
hfenergy: -402.7596494 hartree
pointgroup: C01 [X(C7H11N1O1)]
dipole: 0.0663485 -1.1483444 0.8661485 debye
dipolederiv: -0.7866065 0.0086405 -0.0249679 -0.1053421 -0.7686502 0.3060297 0.0363777 0.2968089 -0.6001138 -1.3762755 -0.2725043 0.1987012 -0.1475726 -0.4206803 -0.0732047 0.2118518 -0.0511554 -0.4793566 0.5171571 -0.0191616 0.0833322 -0.3638605 0.1508055 0.1121135 0.2750082 0.0756669 0.1979809 1.8254204 0.2605502 -0.0603507 0.2714871 0.82038 -0.4318805 0.0075637 -0.3936582 0.5568044 -0.7626079 0.1061453 -0.1177131 0.0062382 -0.0496021 -0.1327528 -0.0867971 -0.132955 -0.1495193 0.1171358 0.1186709 -0.1362839 0.1521604 -0.028867 0.1456187 -0.2950205 0.0941677 0.061512 0.5433603 -0.0221161 0.0915363 0.0611175 0.0070334 -0.1091893 0.0339293 -0.1132647 -0.049438 -0.2979509 0.0664431 -0.0851613 -0.0200944 0.0611233 -0.0033602 -0.0208235 0.0055879 0.0493127 -0.289767 0.0849431 -0.0272553 0.065597 -0.2146299 0.2276179 0.0087755 0.2269967 -0.0544732 -0.1135452 -0.0636785 -0.0745794 -0.0175637 -0.0097943 -0.1482146 -0.0829252 -0.089465 -0.0088926 0.1454701 -0.0455361 0.0524086 0.1115276 0.0320101 0.0400699 -0.015612 0.0378127 0.074876 0.1503132 0.0053034 -0.0248593 0.0328301 0.1740735 0.1230572 -0.0926721 0.1227948 0.2400687 0.0262683 -0.0247323 0.0001345 0.0088248 -0.0270995 0.1491185 -0.0265851 0.147489 0.0639494 0.0802275 -0.0754588 -0.0285041 -0.0669437 0.0362221 -0.1194704 0.0376624 -0.1099436 -0.0190413 0.1013203 0.0136656 -0.0195706 0.0012063 0.0251163 0.0987191 -0.0099 0.0998411 0.081189 -0.0408704 0.0473707 0.0898813 0.1246231 0.0992737 -0.0154949 0.0932825 -0.0423026 -0.0310558 0.0597281 -0.0646521 0.0423934 0.0273741 -0.0591869 0.1284692 -0.0269239 0.118779 0.0181996 0.0071155 -0.0624756 -0.0707013 -0.0432957 -0.0191764 -0.0888757 -0.1502003 -0.0710235 0.0428422 -0.0002199 -0.0069841 0.1130984 -0.0239781 0.1321521 -0.0784065 0.1405493 -0.0731829 -0.0005106 0.0943267 -0.0544333 -0.0015391 -0.0743355 0.0594969 -0.1299643 -0.0375405 -0.1489936 0.0056663 unknown
polarizability: 152.748694|12.3513972|65.4096215|-4.5340537|-7.7324318|62.0227566 unknown
InChI: InChI=1S/C7H11NO/c1-3-5-7(9)8-6-4-2/h3-5,8H,2,6H2,1H3
charge 0 multiplicity 1
20 atoms
O  0.583567 1.257832 -1.160838
N  -0.647832 -0.405866 -0.087027
C  -1.951997 0.072325 -0.57803
C  0.549576 0.229919 -0.410291
C  1.765149 -0.394286 0.195563
C  -2.916401 0.348346 0.557838
C  3.00498 0.113801 -0.040068
C  4.29575 -0.427616 0.514439
C  -4.145641 -0.214082 0.67349
H  -2.39326 -0.658894 -1.28374
H  -1.729577 0.997086 -1.144379
H  -0.633326 -1.222074 0.527116
H  1.634773 -1.277197 0.838058
H  -2.563239 1.064753 1.314002
H  3.058176 0.99773 -0.693508
H  4.984726 -0.712552 -0.30475
H  4.136754 -1.310609 1.15739
H  4.821215 0.345846 1.108196
H  -4.81631 0.034211 1.503382
H  -4.520783 -0.931473 -0.067942
