program: Gaussian 09
title: 000228162
version: EM64L-G09RevD.01
frameworkgroup: C1[X(C18H16Cl2N6O3)]
method: RPBEPBE
basis: SDD
operation: Freq
keyword: #p
keyword: freq=noraman
keyword: PBEPBE/SDD
title: #p freq=noraman PBEPBE/SDD
converged: YES YES NO NO
title: Mulliken charges:
elementType: Cl Cl O O O N N N N N N C C C C C C C C C C C C C C C C C C H H H H H H H H H H H H H H H H
charge: -0.054420 -0.037717 -0.212125 -0.258925 -0.299072 -0.047823 -0.379160 -0.356273 0.087820 0.023779 0.026381 -0.472726 -0.587519 0.223288 0.299324 0.463124 0.462320 -0.373569 -0.365536 -0.354526 -0.347102 -0.387474 -0.360132 -0.211668 -0.206544 -0.206667 -0.200928 -0.098396 -0.102110 0.286818 0.255632 0.269430 0.280364 0.345519 0.344846 0.235593 0.235402 0.287802 0.282912 0.251726 0.221450 0.256287 0.261518 0.258023 0.261050
chargesum: 0.00000
title: Mulliken charges with hydrogens summed into heavy atoms:
elementType: Cl Cl O O O N N N N N N C C C C C C C C C C C C C C C C C C
charge: -0.054420 -0.037717 -0.212125 -0.258925 -0.299072 -0.047823 -0.033640 -0.011427 0.087820 0.023779 0.026381 0.069724 -0.037725 0.223288 0.299324 0.463124 0.462320 -0.137976 -0.130135 -0.066723 -0.064190 -0.135748 -0.138681 0.044619 0.054973 0.051356 0.060121 -0.098396 -0.102110
polarizability: 4.02368045e+02 1.37603366e+01 4.43087091e+02 1.59287865e+01 -2.03541833e+01 1.53817283e+02
1716.lowfreq: -5.4259 -3.1347 -1.3085 -0.0021 0.0009 0.0014 4.7160 13.1738 23.2681
frequency: 3.6135 13.0327 23.2613 31.8257 35.6679 38.4840 45.4102 52.4085 62.7530 87.1542 100.1319 109.4738 116.2482 143.5843 185.1029 191.4276 196.8899 204.5753 212.9175 232.2263 263.0353 277.3854 285.6109 290.4217 303.8724 311.3933 330.5140 366.6982 374.3914 386.6668 411.8354 412.4647 412.7094 414.4477 429.9101 440.7438 477.5236 503.5051 511.8789 515.5382 558.2701 603.5124 623.4523 624.7084 657.4256 674.8402 683.1280 705.6182 718.3407 718.5569 726.7134 764.3972 805.8024 825.3303 825.8827 830.0247 836.9786 844.9786 845.4999 850.2745 899.7533 925.4209 943.5023 947.0846 951.6293 967.2763 969.0017 975.2142 987.7825 989.9260 997.6775 998.7963 1030.7234 1048.5775 1069.6805 1071.3726 1078.0701 1110.3672 1112.5780 1144.1972 1179.7350 1182.4084 1217.1688 1221.4417 1244.1733 1250.9600 1264.5362 1293.7383 1296.2437 1302.5191 1307.7307 1336.5030 1341.2703 1345.7358 1346.9699 1380.1433 1381.0898 1400.9668 1403.6623 1425.2239 1431.8530 1477.0358 1477.3833 1528.7900 1552.3695 1561.1506 1567.2187 1590.9171 1591.5602 1600.4391 1600.7961 1620.9996 1632.9317 2987.8944 3002.7227 3007.8756 3017.9005 3103.6963 3114.8343 3131.3599 3132.0792 3156.2251 3157.8038 3171.0383 3174.4170 3176.1224 3177.8933 3209.0753 3261.7434
redmass: 9.7401 7.7017 5.4118 4.6966 9.9545 7.6564 6.5500 8.2436 5.9928 8.7207 9.6022 8.4171 8.4750 10.4763 5.2025 4.4110 8.6249 6.1844 9.3300 6.4488 4.5097 4.9199 6.1163 6.4728 7.3486 5.9990 3.3749 4.6916 5.6357 6.3002 2.9606 4.8124 3.0293 5.6848 6.4269 3.6879 6.6620 4.5099 2.9061 2.9329 4.4834 6.3365 7.1483 7.1560 6.0275 5.7380 6.0533 4.7961 3.4979 3.3475 2.9926 1.7309 1.1381 1.3430 1.3299 4.5979 4.6976 1.3792 1.4004 5.3329 3.3091 2.3670 1.4076 1.3617 4.6060 5.1095 1.4947 1.4993 1.3656 1.3717 4.0545 3.9822 4.2821 7.0416 2.7407 2.8390 3.1814 1.3632 1.3752 2.1196 1.1176 1.1181 3.3971 3.1874 2.0306 2.2994 1.8228 1.3154 1.3232 2.5680 1.5270 1.4588 2.0029 1.8036 1.4912 3.2738 2.9286 3.8916 3.9076 1.0834 1.0975 2.4770 2.4665 1.8425 3.5474 6.4701 2.4107 4.4425 5.4854 5.8350 5.9837 5.7820 7.6946 1.0880 1.0652 1.0638 1.0893 1.0961 1.0991 1.0898 1.0902 1.0888 1.0888 1.0955 1.0955 1.0976 1.0976 1.0830 1.0785
irintensity: 0.4472 2.0181 0.4652 1.0176 1.0704 0.3117 1.2781 0.2551 9.5537 2.4035 6.9668 12.3515 0.8790 13.6204 5.7445 3.4562 5.2892 7.2865 8.8721 19.8258 15.8356 18.1687 3.8306 0.7019 2.7401 14.6596 25.7328 3.2735 8.7264 20.6244 0.0979 4.3460 1.4305 7.4177 3.2795 1.6651 0.5914 4.3352 17.5231 22.2575 12.1116 20.0249 0.6862 1.5128 37.5895 15.4827 6.3010 5.4785 1.6638 2.1585 58.4109 125.5578 127.4926 4.4637 19.8543 12.2480 23.5544 26.1805 23.7052 25.7251 44.9582 9.2408 23.0443 14.3829 7.7567 57.7931 17.1722 37.3292 2.5692 6.0664 40.7853 45.9501 19.7410 63.3403 56.4753 73.0452 167.7295 10.9590 2.9548 53.4738 1.6295 3.8628 150.0099 10.3526 43.5791 170.4866 112.4857 5.7426 5.6975 122.3808 1.4338 9.8706 20.0103 11.3951 6.6581 16.0527 8.5798 11.7636 11.7508 6.5043 58.4296 63.0449 121.7386 135.1480 32.2326 31.0226 84.5394 71.2380 61.1094 20.7422 119.3129 606.8083 343.3674 35.3234 12.5486 10.7647 22.7734 0.5573 4.3711 8.8720 7.6756 0.3907 0.1773 4.6775 4.1553 3.5128 2.7966 612.6696 88.6811
temp: 298.150 k
press: 1.00000 atm
elementType: 17 17 8 8 8 7 7 7 7 7 7 6 6 6 6 6 6 6 6 6 6 6 6 6 6 6 6 6 6 1 1 1 1 1 1 1 1 1 1 1 1 1 1 1 1
symmnumber: 1
zpe: 843890.3 jmol-1
zpe.correction: 0.321421 hartree
zpe.thermalcorrener: 0.348691 hartree
zpe.thermalcorrenthalpy: 0.349635 hartree
zpe.thermalcorrgfe: 0.256804 hartree
zpe.sumelectzpe: -2167.633288 hartree
zpe.sumelectthermal: -2167.606018 hartree
zpe.sumelectthermalent: -2167.605074 hartree
zpe.sumelectthermalfe: -2167.697904 hartree
dipole: -6.0883 2.7676 3.6837
dipole: 7.6352
quadrupole: -196.4389 -181.1075 -186.3940
quadrupole: -9.5898 7.9961 14.5774
quadrupole: -8.4588 6.8726 1.5861 -9.5898 7.9961 14.5774
hfenergy: -2167.9547088 hartree
pointgroup: C01 [X(C18H16Cl2N6O3)]
dipole: -1.1758391 2.7371635 -0.3858744 debye
polarizability: 435.7406484|31.6625505|361.968577|-43.4011892|90.3035349|201.5631935 unknown
InChI: InChI=1S/C18H16Cl2N6O3/c19-15-5-1-13(2-6-15)9-21-23-17(27)11-26(25-29)12-18(28)24-22-10-14-3-7-16(20)8-4-14/h1-10,23-24H,11-12H2
charge 0 multiplicity 1
45 atoms
Cl 5.153871 -6.142853 -2.818661
Cl 5.010568 6.225181 2.011107
O  -3.295669 -4.053139 0.002684
O  -1.237236 0.389264 -1.471279
O  -3.987496 1.260752 1.733523
N  -3.919055 -0.409498 0.230605
N  -1.894344 -2.363198 -0.843102
N  -1.829086 2.063548 0.081867
N  -4.179886 -0.005565 1.529212
N  -0.838692 -3.244788 -1.077904
N  -0.545653 2.588166 0.190059
C  -4.22227 -1.824169 -0.066991
C  -3.585212 0.600411 -0.805582
C  -3.068357 -2.849355 -0.285088
C  -2.094627 1.016689 -0.775678
C  1.417698 -3.557883 -1.884228
C  0.92796 4.14979 1.313452
C  2.584488 -2.965902 -2.440573
C  1.069373 5.143259 2.321089
C  1.412691 -4.957921 -1.617904
C  2.060109 3.798702 0.522151
C  0.251215 -2.713828 -1.598985
C  -0.37708 3.514036 1.114286
C  3.726076 -3.744084 -2.728222
C  2.308508 5.77956 2.540946
C  2.54423 -5.744681 -1.900073
C  3.30076 4.426436 0.731798
C  3.686506 -5.124285 -2.452361
C  3.407045 5.410736 1.739927
H  -4.787221 -2.210667 0.796358
H  -4.883913 -1.871982 -0.953463
H  -3.785754 0.159849 -1.793881
H  -4.24219 1.475636 -0.643325
H  -1.774859 -1.362702 -1.105152
H  -2.59448 2.312626 0.7412
H  2.601805 -1.889613 -2.650177
H  0.20755 5.42179 2.939419
H  0.511739 -5.407879 -1.189546
H  1.946493 3.03255 -0.25078
H  0.336376 -1.636328 -1.8344
H  -1.201795 3.849436 1.774635
H  4.623794 -3.289079 -3.156052
H  2.418598 6.542889 3.316045
H  2.544538 -6.819372 -1.696841
H  4.172879 4.160667 0.127686
