program: Gaussian 09
title: 000228141
version: EM64L-G09RevD.01
frameworkgroup: C1[X(C11H18O2)]
method: RPBEPBE
basis: SDD
operation: Freq
keyword: #pfreq=noraman
keyword: PBEPBE/SDD
title: #p freq=noraman PBEPBE/SDD
converged: NO YES NO NO
title: Mulliken charges:
elementType: O O C C C C C C C C C C C H H H H H H H H H H H H H H H H H H
charge: -0.271315 -0.254159 -0.095457 -0.133400 -0.502508 -0.057599 -0.483897 -0.451285 -0.445658 -0.468091 -0.393143 0.283422 -0.760736 0.256595 0.239276 0.218778 0.228587 0.250577 0.207652 0.221884 0.205987 0.207592 0.218161 0.217409 0.211481 0.215313 0.204676 0.195605 0.246101 0.244648 0.243506
chargesum: 0.00000
title: Mulliken charges with hydrogens summed into heavy atoms:
elementType: O O C C C C C C C C C C C
charge: -0.271315 -0.254159 0.161139 0.105875 -0.055143 0.192978 -0.054362 -0.037707 -0.010088 -0.041298 0.007138 0.283422 -0.026480
polarizability: 1.36272800e+02 -3.50979099e+00 1.13080093e+02 -2.11605792e+00 -6.32407208e-01 1.04726917e+02
1716.lowfreq: -25.2571 -14.8848 -0.0007 0.0002 0.0005 8.8004 14.9253 38.4593 64.1572
frequency: 14.4926 38.2830 63.7820 70.9241 87.1954 149.4564 181.2977 224.8830 277.4906 277.8847 310.0201 357.7102 399.5501 442.4548 512.0365 559.3425 584.8994 614.1277 626.6821 651.1412 775.4364 783.3414 815.3710 828.6581 868.0817 889.1807 890.8526 899.9935 918.9689 943.8478 973.4504 997.4992 1012.6216 1022.9688 1040.0305 1049.2117 1061.5869 1064.7392 1103.1978 1127.0273 1142.0143 1175.2671 1195.3905 1205.6890 1209.6269 1221.2519 1246.7040 1257.4957 1264.4775 1282.0161 1295.4554 1301.6461 1312.7450 1318.7990 1331.9964 1334.4252 1345.7681 1360.9691 1371.3955 1381.1449 1453.0696 1455.0133 1461.2434 1465.3975 1468.5803 1471.3932 1479.3137 1491.2603 1640.8553 2969.7024 2970.6223 2980.1297 2989.3996 2992.4546 2996.6997 3000.4497 3005.9810 3008.0144 3016.3329 3031.0304 3038.6280 3040.7332 3055.7229 3058.3537 3078.3816 3094.1213 3141.1592
redmass: 1.1358 5.7008 1.8683 2.9545 2.9450 2.7754 2.5521 4.3148 2.5524 3.3027 2.1918 3.0810 3.6561 2.8544 2.7502 2.9885 2.3127 3.1550 3.8062 2.3351 2.3594 1.6132 1.9467 3.5355 2.6487 2.8621 1.7805 2.0209 1.9997 3.4770 2.0358 1.9664 1.9641 1.9034 1.6666 1.8181 1.4131 1.8438 1.3896 1.9763 2.0877 1.4211 1.4459 2.1875 2.3326 1.3037 1.3000 1.3758 1.2525 1.2210 1.3816 1.3113 1.2774 1.4413 1.4746 1.5282 1.4896 1.4361 1.4990 1.2689 1.0655 1.0475 1.0866 1.0877 1.0845 1.0878 1.0890 1.0928 9.1194 1.0626 1.0640 1.0736 1.0736 1.0657 1.0707 1.0672 1.0370 1.0828 1.0662 1.0974 1.0997 1.1012 1.1032 1.1029 1.1039 1.0973 1.1010
irintensity: 1.5051 1.0790 0.0058 1.5343 1.4356 1.7697 3.0141 4.3782 2.4603 1.3958 0.7287 3.5401 0.4069 1.9824 1.7008 1.8743 3.8908 4.0839 3.5732 2.8116 0.4746 3.3548 5.0094 7.5693 12.2251 4.1095 1.0656 9.2966 0.4138 84.0055 3.4351 107.2875 1.7822 1.0461 9.2541 5.4752 0.2403 2.1134 0.3963 0.6849 3.2507 4.4654 17.7817 157.6767 191.1201 4.4960 2.3154 3.8981 3.2638 11.3839 2.7517 0.9228 0.6803 0.8653 1.6144 2.7009 3.4312 3.1124 6.7201 50.0539 26.6797 17.6942 7.1900 3.9939 1.3268 9.5434 14.4859 13.7945 175.1959 35.1398 20.3331 23.4776 8.6976 32.9024 15.7282 46.7544 2.1361 41.0762 26.5664 63.2503 58.4407 20.2907 33.3126 37.4373 84.0583 9.2823 12.1189
temp: 298.150 k
press: 1.00000 atm
elementType: 8 8 6 6 6 6 6 6 6 6 6 6 6 1 1 1 1 1 1 1 1 1 1 1 1 1 1 1 1 1 1
symmnumber: 1
zpe: 711287.8 jmol-1
zpe.correction: 0.270915 hartree
zpe.thermalcorrener: 0.284124 hartree
zpe.thermalcorrenthalpy: 0.285069 hartree
zpe.thermalcorrgfe: 0.229014 hartree
zpe.sumelectzpe: -579.401846 hartree
zpe.sumelectthermal: -579.388637 hartree
zpe.sumelectthermalent: -579.387693 hartree
zpe.sumelectthermalfe: -579.443747 hartree
dipole: -1.0758 0.4553 -1.6876
dipole: 2.0525
quadrupole: -76.0332 -76.9452 -83.8474
quadrupole: -0.8399 -6.5667 1.6793
quadrupole: 2.9087 1.9967 -4.9054 -0.8399 -6.5667 1.6793
hfenergy: -579.6727617 hartree
pointgroup: C01 [X(C11H18O2)]
dipole: -0.4250129 0.1930975 -0.6589047 debye
polarizability: 136.7438793|-1.4893263|112.7465769|-1.6342068|-0.238353|104.5893536 unknown
InChI: InChI=1S/C11H18O2/c1-8(12)13-11-7-3-5-9-4-2-6-10(9)11/h9-11H,2-7H2,1H3
charge 0 multiplicity 1
31 atoms
O  1.764052 0.576849 -0.451907
O  2.68989 -0.233714 1.533971
C  -0.359822 -0.506339 0.304481
C  -1.832028 -0.278554 0.777856
C  -0.505102 -1.291025 -1.033746
C  0.445467 0.806585 0.241541
C  -2.487391 -1.645162 0.445514
C  -2.510364 0.896721 0.027307
C  -1.858956 -2.071995 -0.91921
C  -0.252583 1.935159 -0.526819
C  -1.658019 2.185895 0.07276
C  2.800329 0.043505 0.316345
C  4.044401 -0.135563 -0.529892
H  0.133367 -1.166495 1.044761
H  -1.862803 -0.067272 1.865688
H  0.351441 -1.968682 -1.191811
H  -0.523035 -0.600856 -1.896444
H  0.676065 1.131972 1.275563
H  -3.590734 -1.582834 0.402377
H  -2.228986 -2.381032 1.230883
H  -3.509757 1.081094 0.467375
H  -2.677609 0.614057 -1.031913
H  -1.706534 -3.165074 -0.963399
H  -2.529671 -1.810388 -1.757944
H  -0.344369 1.66183 -1.595551
H  0.368016 2.848771 -0.4775
H  -2.161012 3.000381 -0.482317
H  -1.558037 2.529529 1.123387
H  4.341364 0.827687 -0.979287
H  3.83995 -0.834305 -1.359945
H  4.863266 -0.526244 0.091076
