program: Gaussian 09
title: 000228138
version: EM64L-G09RevD.01
frameworkgroup: C1[X(C11H9NO5)]
method: RPBEPBE
basis: SDD
operation: Freq
keyword: #p
keyword: freq=noraman
keyword: PBEPBE/SDD
title: #p freq=noraman PBEPBE/SDD
converged: YES YES NO NO
title: Mulliken charges:
elementType: O O O O O N C C C C C C C C C C C H H H H H H H H H
charge: -0.242467 -0.244357 -0.178175 -0.190651 -0.151867 0.006424 0.284402 0.114231 0.404992 0.140628 -0.379420 0.220169 -0.372501 -0.475436 -0.805395 0.135624 -0.532258 0.252894 0.267157 0.257807 0.245302 0.243204 0.242526 0.246845 0.271708 0.238613
chargesum: 0.00000
title: Mulliken charges with hydrogens summed into heavy atoms:
elementType: O O O O O N C C C C C C C C C C C
charge: -0.242467 -0.244357 -0.178175 -0.190651 -0.151867 0.006424 0.284402 0.114231 0.404992 0.140628 -0.126526 0.220169 -0.105344 -0.217629 -0.074362 0.135624 0.224908
polarizability: 2.19751838e+02 -1.67975911e+01 1.74115601e+02 -3.01252922e+00 2.68724565e+00 7.76967765e+01
1716.lowfreq: -4.9943 -0.0005 -0.0004 0.0004 3.7542 8.7858 41.7185 59.6698 83.4478
frequency: 41.7013 59.6502 83.4453 105.1306 131.3018 140.2511 171.0300 197.4555 206.1329 221.1197 247.4524 273.8531 280.5727 301.3102 328.2854 406.2896 416.2527 438.3619 498.1990 512.8319 523.6826 549.4775 591.0952 615.6945 648.7472 667.5109 685.5216 715.4970 735.4498 751.0245 764.9357 821.7971 873.6150 876.7133 924.6395 960.4341 1001.2278 1039.1090 1047.4980 1087.3023 1109.3823 1127.6633 1156.5699 1165.3215 1213.6746 1225.7752 1249.5510 1273.4407 1365.0619 1378.8423 1381.8080 1403.2879 1415.0610 1441.8934 1466.0699 1468.5977 1471.0022 1478.3169 1492.0361 1534.8466 1608.6063 1614.1205 1705.8231 2983.5268 2995.4401 3060.4704 3103.1528 3105.8989 3140.6033 3159.4324 3174.8919 3184.5347
redmass: 6.3923 5.9424 5.2757 8.5277 4.5201 9.1457 1.7305 2.8159 1.6773 4.2588 1.8948 2.4686 4.5733 6.6452 5.1989 7.0844 6.3703 6.0990 5.4092 5.3717 5.8129 5.8225 4.9445 4.7586 5.9934 6.9990 4.8024 10.0585 9.3288 7.7279 6.8804 1.4935 6.5284 1.4181 8.8210 1.3198 1.6219 4.7947 1.5705 6.8049 1.2583 3.5773 1.4056 1.5500 3.0556 4.8989 1.4272 5.6561 3.5878 7.4111 2.8438 1.3389 4.8345 1.4829 1.0638 1.0463 1.1134 1.0731 3.2064 6.9464 7.4952 7.1632 10.9647 1.0385 1.0310 1.0970 1.1044 1.0984 1.1038 1.0883 1.0921 1.0966
irintensity: 2.3365 2.8120 2.7785 1.4071 2.7678 0.7894 0.0307 2.7484 1.1001 1.4221 0.8298 1.5681 4.2957 3.2238 1.0674 10.1045 2.0260 14.4501 8.3749 2.9923 4.2958 1.3992 5.5439 0.9262 2.5571 10.8189 4.5240 16.7167 38.8269 9.5387 19.1229 33.8220 20.8952 35.4309 29.6623 0.3716 2.4117 192.5682 7.9013 9.1332 1.8120 0.3473 15.2035 13.2029 50.4959 71.7368 2.2211 231.7964 61.4717 134.2829 64.6263 52.6970 61.1511 18.8687 12.5179 17.1189 13.2964 23.9366 25.1389 19.5345 207.8917 171.7415 522.0594 10.1540 38.7765 11.1991 15.4520 18.6434 16.3577 3.6826 0.9477 2.4378
temp: 298.150 k
press: 1.00000 atm
elementType: 8 8 8 8 8 7 6 6 6 6 6 6 6 6 6 6 6 1 1 1 1 1 1 1 1 1
symmnumber: 1
zpe: 482072.9 jmol-1
zpe.correction: 0.183612 hartree
zpe.thermalcorrener: 0.198815 hartree
zpe.thermalcorrenthalpy: 0.199759 hartree
zpe.thermalcorrgfe: 0.141144 hartree
zpe.sumelectzpe: -854.114398 hartree
zpe.sumelectthermal: -854.099195 hartree
zpe.sumelectthermalent: -854.098251 hartree
zpe.sumelectthermalfe: -854.156866 hartree
dipole: 0.2656 7.8987 -0.8057
dipole: 7.9441
quadrupole: -81.0852 -108.5846 -100.8008
quadrupole: 10.1993 4.0688 -0.4894
quadrupole: 15.7383 -11.7611 -3.9773 10.1993 4.0688 -0.4894
hfenergy: -854.2980101 hartree
pointgroup: C01 [X(C11H9N1O5)]
dipole: 0.0776181 3.1223501 -0.1159311 debye
dipolederiv: -1.1375778 -0.5438678 0.0639824 -0.3696354 -0.5697466 0.0364021 0.0403404 0.0245441 -0.1645546 -1.9606223 -0.0198224 -0.1399228 0.1218576 -0.2797041 0.008486 -0.0633427 0.0663682 -0.2933661 -0.6792214 -0.3066944 0.0393932 -0.7266044 -1.2348359 0.1050849 0.0854967 0.110906 -0.3286493 -0.4497831 0.2136332 0.2075311 0.2747811 -0.4475957 -0.0913669 0.1679732 0.0043185 -0.5992377 -0.2386903 0.0833566 0.0338406 0.1612198 -0.5313806 0.2154831 0.1067777 0.1109143 -0.601728 0.4602141 -0.4033867 -0.2956931 -0.5902525 0.9868719 -0.163095 -0.2733211 -0.1364427 1.0843353 -0.7394723 0.0099664 -0.0199175 -0.0183053 -0.400327 0.0432181 -0.0017654 0.0520883 -0.035863 0.6871586 0.0566478 0.0229316 0.2469921 0.4822157 -0.0392649 -0.0735589 0.0591031 0.132122 0.9922722 0.1199196 0.0017908 0.0676712 0.573851 -0.071685 -0.0014629 -0.0869426 0.0328816 -0.4117552 0.0408352 0.0085929 -0.1501047 -0.2741114 0.0360406 0.0546091 0.061821 -0.1289639 0.5076245 0.1762097 -0.0097719 0.2486101 0.2134673 -0.0396921 -0.0228381 -0.0480335 -0.1092517 1.703174 0.2008688 0.0846623 -0.0397706 0.202608 0.0324788 0.0934633 -0.1199062 0.1357658 -0.6793598 -0.0733343 -0.0259773 0.471288 0.0270211 -0.0212869 -0.1329276 -0.0389371 -0.1691398 -0.1511159 0.0914764 -0.0142033 -0.4435108 -0.8201762 0.070028 0.0605062 0.0862574 -0.1964989 -0.0381076 0.0699851 -0.011142 0.1621273 -0.177536 0.0325761 -0.0287432 0.0367614 0.0383752 1.2929283 0.4217626 -0.0546829 0.9486091 1.7105397 -0.1647744 -0.1078533 -0.1763227 0.3041279 0.7482829 -0.0826488 0.0948634 -0.4523487 0.2631012 -0.0632446 0.210558 -0.0285572 0.2627065 0.0699034 0.0930743 -0.0164033 0.0631079 -0.0185474 0.0247856 -0.0016008 0.029459 0.1368832 0.0485866 -0.0603666 0.0083134 -0.0476658 0.0163018 0.0213072 -0.0188162 0.0199676 0.1673172 -0.0385611 0.016379 -0.0017511 0.0110441 0.0811613 0.0105521 -0.0012396 0.0106766 0.1665715 -0.1249673 0.0187031 -0.0002357 -0.095539 0.0818727 0.0052777 0.0161819 0.0038603 0.1137827 0.0814259 -0.0127617 0.0742004 0.0066815 0.0406361 0.0676703 0.0377763 0.0853618 -0.0425088 0.080663 -0.0362574 -0.0690947 -0.0075449 -0.0084751 -0.0791186 -0.0387452 -0.0969268 0.0083105 -0.1079199 -0.055703 -0.0451183 -0.0961567 0.0411937 -0.0079118 -0.0711095 -0.0045754 0.1278152 0.0835544 0.0085661 -0.0406679 0.1511961 -0.0020704 -0.0524805 -0.022082 -0.0831004 0.0095329 0.0013661 -0.0265408 0.1044797 0.1022531 0.0436647 0.08453 -0.0142763 0.0573371 -0.0507657 unknown
polarizability: 221.6468398|13.6450728|169.8155104|-3.401315|-15.2374757|80.1018651 unknown
InChI: InChI=1S/C11H9NO5/c1-6-5-9(13)17-11-7(6)3-4-8(16-2)10(11)12(14)15/h3-5H,1-2H3
charge 0 multiplicity 1
26 atoms
O  -0.98119 -1.236932 0.348404
O  3.201561 1.319221 0.04331
O  -2.937222 -2.46402 0.484446
O  2.423079 -1.782036 -0.699141
O  1.587921 -2.036129 1.412577
N  1.739861 -1.375659 0.321574
C  -1.04697 1.196098 0.013071
C  -0.334422 -0.02163 0.202154
C  -2.505986 1.153237 0.013966
C  1.086873 -0.051563 0.201545
C  -0.283723 2.384999 -0.180877
C  1.829281 1.14663 0.023929
C  1.110346 2.363786 -0.175558
C  -3.148093 -0.060128 0.181023
C  -3.299325 2.427871 -0.167501
C  -2.455735 -1.328965 0.347319
C  4.144009 0.289852 0.530401
H  -0.800876 3.336945 -0.331422
H  1.701206 3.273785 -0.306953
H  -4.239394 -0.125205 0.18829
H  -4.381959 2.229564 -0.125504
H  -3.076725 2.901901 -1.141982
H  -3.055397 3.166667 0.618753
H  5.078599 0.84271 0.700487
H  4.289859 -0.495828 -0.228277
H  3.790821 -0.152872 1.479167
