program: Gaussian 09
title: 000228136
version: EM64L-G09RevD.01
frameworkgroup: C1[X(C11H12O2)]
method: RPBEPBE
basis: SDD
operation: Freq
keyword: #pfreq=noraman
keyword: PBEPBE/SDD
title: #p freq=noraman PBEPBE/SDD
converged: YES YES NO NO
title: Mulliken charges:
elementType: O O C C C C C C C C C C C H H H H H H H H H H H H
charge: -0.283715 -0.265697 0.333905 0.328786 -0.368872 -0.359580 -0.837041 -0.430073 -0.237768 -0.240375 -0.234846 0.211269 -0.503338 0.240287 0.237122 0.232445 0.227870 0.304165 0.245812 0.228333 0.229575 0.232625 0.239040 0.230439 0.239629
chargesum: 0.00000
title: Mulliken charges with hydrogens summed into heavy atoms:
elementType: O O C C C C C C C C C C C
charge: -0.283715 -0.265697 0.333905 0.328786 -0.128585 -0.122457 -0.072561 -0.184261 -0.009434 -0.010800 -0.002221 0.211269 0.205770
polarizability: 2.22576111e+02 3.66254272e+00 1.26095106e+02 -3.07451883e+00 -5.09621179e+00 6.37040558e+01
1716.lowfreq: -13.9624 -5.2735 0.0003 0.0004 0.0006 4.0315 38.4071 62.6918 76.3829
frequency: 38.3602 62.6867 76.3605 88.5450 94.7030 153.2988 164.3419 207.9611 260.4976 280.9668 323.3507 341.0336 402.7040 410.5317 471.2397 564.1825 579.9503 615.5389 684.6123 687.6299 699.6667 760.6513 772.2400 846.9857 868.4390 895.4290 925.8523 937.0858 977.4371 988.6354 997.8054 1016.7777 1027.1147 1041.4118 1082.0439 1095.8101 1111.7016 1121.4204 1147.0202 1175.8907 1199.8668 1281.4136 1319.6627 1350.9921 1382.4770 1395.2426 1420.7609 1436.4339 1449.6507 1459.5969 1463.8865 1484.1635 1488.0678 1580.3370 1606.2242 1613.9848 1629.3307 2976.4235 2999.0469 3054.1441 3097.2191 3124.7540 3126.8523 3134.4346 3143.2902 3147.0512 3156.1301 3158.7542 3168.9556
redmass: 3.8879 3.0436 2.6248 1.4423 3.7206 2.2050 1.3213 4.2383 4.7584 5.8346 3.6993 3.9288 2.8717 3.7746 3.7990 2.5054 4.5985 6.3950 4.1700 4.7957 1.9085 4.5530 1.9075 1.2861 5.1733 1.5125 1.4706 3.4913 1.4199 5.4226 1.3320 2.7729 2.6449 1.5586 1.8281 1.7249 1.2691 3.2987 1.4628 1.0537 1.1229 3.3901 1.3923 1.7153 4.0890 1.2890 1.1969 2.1877 1.0503 1.1289 1.0570 1.5626 1.3076 5.4144 6.3508 7.3786 6.2726 1.0413 1.0298 1.0933 1.1040 1.0979 1.0847 1.0878 1.1042 1.0927 1.0942 1.0906 1.1010
irintensity: 0.8292 0.4786 3.1916 0.0665 0.5794 0.2680 1.2543 4.3367 6.0766 4.5972 15.9612 2.2953 0.1870 7.6875 10.3740 3.2370 4.4123 0.0349 7.3641 6.5877 37.0771 1.6747 73.3349 2.5730 15.4690 27.0383 0.4076 5.7125 1.5024 0.9449 0.0738 106.6830 3.6188 2.0291 31.7144 16.9432 1.0018 395.3812 4.9304 0.1986 5.0354 39.3925 4.6756 44.2183 10.4152 33.4589 18.2968 13.7754 13.5384 89.1139 15.1754 13.9496 9.5473 16.5431 86.2024 143.9126 213.7415 19.9834 47.3086 18.4886 30.2650 1.7487 2.0900 2.6126 20.3081 20.7932 18.1230 17.8591 20.7136
temp: 298.150 k
press: 1.00000 atm
elementType: 8 8 6 6 6 6 6 6 6 6 6 6 6 1 1 1 1 1 1 1 1 1 1 1 1
symmnumber: 1
zpe: 525442.1 jmol-1
zpe.correction: 0.200130 hartree
zpe.thermalcorrener: 0.213029 hartree
zpe.thermalcorrenthalpy: 0.213973 hartree
zpe.thermalcorrgfe: 0.159688 hartree
zpe.sumelectzpe: -575.859917 hartree
zpe.sumelectthermal: -575.847019 hartree
zpe.sumelectthermalent: -575.846075 hartree
zpe.sumelectthermalfe: -575.900359 hartree
dipole: 1.6051 -0.9863 -0.1959
dipole: 1.8940
quadrupole: -63.3071 -72.8462 -79.7097
quadrupole: 6.3947 0.2214 -2.6133
quadrupole: 8.6472 -0.8919 -7.7554 6.3947 0.2214 -2.6133
hfenergy: -576.0600476 hartree
pointgroup: C01 [X(C11H12O2)]
dipole: -0.6417239 0.2696649 0.2659944 debye
dipolederiv: -1.3529782 -0.2930826 -0.3216854 -0.5709643 -0.5935023 -0.3023181 -0.6193892 -0.3056004 -0.632459 -0.9835483 0.1474066 0.1404211 0.1423706 -0.5847375 -0.2751417 0.1695648 -0.2804219 -0.600286 -0.0980466 0.0403154 0.0412516 0.122539 -0.055866 -0.043359 0.0331885 -0.0608243 -0.0732841 0.910821 -0.0453026 -0.0665101 0.081942 0.1886387 0.2076021 0.2160218 0.2459421 0.2626841 -0.0150046 -0.0359173 -0.0591535 0.0454832 -0.1319661 0.0521996 0.031219 0.0727044 0.0356035 -0.0632319 -0.0106975 0.0902188 -0.0987012 -0.1209832 0.0306333 0.0068743 0.0186007 -0.0081458 -0.1649804 0.0210639 0.015819 0.0746861 -0.044016 -0.1373323 -0.0097965 -0.1838771 -0.1685895 -1.350731 -0.0785258 -0.0813308 -0.2011099 -0.1517324 0.0250936 -0.2473413 0.0358537 -0.1750845 -0.0032712 0.0173749 0.1221752 0.0441452 -0.1412911 0.0337543 0.2250397 0.0311921 0.0062711 -0.1235561 -0.0188924 -0.0456973 -0.0216482 -0.1153075 0.0893102 -0.1088934 0.0829699 0.106571 0.0348553 -0.0445007 -0.0281919 -0.035803 -0.1363634 0.0387271 -0.0323205 0.0423991 -0.0449784 2.2876351 0.1603736 0.1967205 0.2952616 0.7734009 0.5536659 0.264483 0.5677917 0.8385781 0.7606778 0.1182354 0.134042 0.0676009 0.2714455 -0.0083676 0.087783 -0.0094636 0.2695547 0.1104501 0.0185278 0.053978 -0.0004974 0.1172326 -0.0700685 0.0430142 -0.072701 -0.056334 0.0093476 -0.0051009 -0.1092597 0.001721 0.1297007 -0.0298847 -0.0853267 -0.0205289 0.0219244 0.0236624 -0.1313617 0.0141679 -0.1283915 -0.0359864 -0.0037972 0.0213474 0.0237651 0.0818213 0.1019619 0.0316628 -0.0809233 0.0127189 0.0351464 0.0699709 -0.0759542 0.0422561 -0.0608785 0.043511 0.1013287 0.0688703 0.0297332 0.1124763 0.0013553 0.0126294 0.018008 0.1349015 0.0794145 0.0263841 0.0253974 0.05623 0.0576137 -0.0970587 0.0638344 -0.108014 0.0531761 -0.0457461 -0.0090323 -0.0980706 -0.017945 0.1461561 -0.040244 -0.1203202 -0.040177 -0.0062499 0.0581311 0.025417 0.0381707 0.0422915 0.1280686 -0.0771638 0.0692816 -0.0826522 -0.0819201 -0.1167654 0.0501299 0.0424658 0.0488894 0.144644 -0.0307899 0.0475311 -0.0295982 0.0885046 -0.0588875 -0.0027532 -0.0450487 0.1044859 -0.0878035 0.0775452 -0.0013208 0.0416735 0.0848045 0.0183133 -0.0401559 -0.0425763 -0.0911668 0.0136333 -0.11176 -0.095582 -0.1113424 0.0030741 -0.0620338 -0.0428972 -0.0052507 -0.0038711 0.0813987 0.0474278 0.1044327 0.0820446 -0.0792593 unknown
polarizability: 222.2634477|0.3765479|77.7209125|7.3214555|26.6007101|112.3909123 unknown
InChI: InChI=1S/C11H12O2/c1-9(8-11(12)13-2)10-6-4-3-5-7-10/h3-8H,1-2H3
charge 0 multiplicity 1
25 atoms
O  3.326558 0.830364 0.856449
O  3.241751 -0.769988 -0.838234
C  -1.257322 -0.129248 -0.1843
C  0.164218 -0.434973 -0.531089
C  -2.293421 -0.330364 -1.140692
C  -1.629188 0.349709 1.106481
C  0.413993 -1.424071 -1.65452
C  1.183061 0.192942 0.15154
C  -3.638829 -0.037005 -0.832703
C  -2.973132 0.636982 1.417442
C  -3.986733 0.450634 0.447408
C  2.62914 -0.008594 -0.041774
C  4.800463 0.742108 0.783711
H  -2.045991 -0.702135 -2.140124
H  -0.866258 0.466052 1.883563
H  -0.221979 -2.319815 -1.535379
H  0.156814 -0.970255 -2.632283
H  1.471648 -1.718901 -1.69533
H  0.949813 0.944745 0.91195
H  -4.41473 -0.18904 -1.591196
H  -3.233293 0.994735 2.419847
H  -5.031692 0.67287 0.690176
H  5.13778 -0.282298 1.017547
H  5.163409 1.459142 1.533729
H  5.153616 1.010703 -0.226717
